program: Gaussian 09
title: 000178074
version: EM64L-G09RevD.01
frameworkgroup: C1[X(C18H20FN3O3)]
method: RPBEPBE
basis: SDD
operation: Freq
keyword: #p
keyword: freq=noraman
keyword: PBEPBE/SDD
title: #p freq=noraman PBEPBE/SDD
converged: YES YES NO NO
title: Mulliken charges:
elementType: F O O O N N N C C C C C C C C C C C C C C C C C C H H H H H H H H H H H H H H H H H H H H
charge: -0.195596 -0.240836 -0.395289 -0.290883 -0.208312 -0.294635 -0.612883 -0.261201 -0.504696 -0.532244 0.353783 0.110824 -0.138896 -0.347108 -0.373247 -0.485340 0.198468 0.156692 -0.417897 0.185830 0.035890 -0.300416 0.155959 -0.806347 0.098327 0.240973 0.233954 0.233463 0.238663 0.244242 0.232833 0.238693 0.230359 0.246132 0.239128 0.236634 0.230598 0.292468 0.325051 0.235690 0.243695 0.238880 0.273132 0.283947 0.371523
chargesum: 0.00000
title: Mulliken charges with hydrogens summed into heavy atoms:
elementType: F O O O N N N C C C C C C C C C C C C C C C C C C
charge: -0.195596 -0.240836 -0.023766 -0.290883 -0.208312 -0.294635 -0.055804 -0.020229 -0.037279 -0.049339 0.353783 0.110824 0.093937 0.121943 0.112012 -0.018109 0.198468 0.156692 -0.125429 0.185830 0.035890 0.024635 0.155959 -0.088083 0.098327
polarizability: 4.08605753e+02 -5.41980543e+00 2.45475593e+02 4.73375652e+00 7.67038700e+00 1.27398855e+02
1716.lowfreq: -11.3668 -4.4507 -1.6677 -0.0008 -0.0004 0.0003 19.9140 40.3461 47.9582
frequency: 19.4497 40.0825 47.9487 50.0374 59.1906 67.6055 82.9089 99.2268 131.3966 152.9443 164.0713 178.3515 189.8168 198.2584 206.6662 230.0951 241.1817 256.0530 273.1002 283.0037 311.0721 322.4758 347.6838 362.8479 380.0398 380.5832 394.5482 396.7017 436.8783 468.2133 477.6886 491.6047 523.2508 532.6068 548.6031 576.5050 586.1018 594.9351 625.3761 638.9912 669.8178 693.9455 699.2181 721.2223 732.9569 761.1917 770.5949 786.6376 810.6950 829.3527 842.2580 864.2156 887.2553 889.4104 915.9438 917.8480 945.2001 964.1101 974.3127 979.1985 993.4397 1009.3309 1032.4922 1035.2771 1038.1911 1048.8223 1069.7557 1086.6959 1089.8000 1100.6549 1106.2311 1115.7095 1147.7594 1155.8952 1164.0841 1169.8901 1182.3267 1201.4485 1221.0814 1228.3406 1237.6728 1257.8496 1285.8626 1288.7714 1301.6506 1306.0122 1323.4602 1338.2890 1355.9834 1360.7279 1364.6112 1370.3382 1392.5721 1392.8477 1440.0400 1450.3403 1463.6827 1468.7051 1471.7168 1480.7074 1483.1982 1491.0276 1493.8999 1503.2350 1580.2585 1601.0063 1645.3519 1648.7266 1664.1172 2886.2782 2982.6681 2995.0423 3009.4725 3016.4126 3047.8604 3066.4654 3075.1279 3085.2424 3088.1389 3089.5398 3104.6156 3114.0428 3146.8099 3171.5055 3188.6650 3209.3861 3461.4963 3502.0022 3584.6524
redmass: 5.7635 3.7982 10.4410 5.7876 5.5506 2.8991 3.0052 5.3382 4.0210 3.1975 3.6169 3.1858 1.6979 2.0078 3.0416 4.8007 3.9030 1.6798 7.3012 3.5499 4.2600 2.9118 4.5873 3.6079 4.5627 5.5133 5.9690 5.8685 5.6635 4.0379 2.1431 3.8011 4.8954 4.3857 4.1617 4.0963 4.3326 1.3268 1.4655 4.5135 5.4865 7.0635 5.8647 4.3415 5.6905 3.6320 7.1984 1.5443 1.9821 1.3781 1.9513 5.5608 5.5508 2.4108 3.9520 1.3362 1.4641 2.5933 1.5843 1.6893 2.5448 2.6658 1.6707 2.1841 1.8745 1.2375 1.2265 2.2801 2.0448 1.7515 1.2715 2.9680 1.7111 1.5903 2.3189 1.4408 1.5454 2.3054 2.7694 1.4471 1.2933 1.5740 1.3759 1.4296 3.4714 1.7407 2.2031 1.5433 1.6306 3.4047 3.8459 1.8721 2.2222 1.7992 1.0939 2.6578 3.1956 1.3264 1.1406 1.2502 1.5403 1.2129 1.5421 1.8423 6.5680 7.6533 8.2329 1.0975 11.8805 1.0829 1.0552 1.0396 1.0578 1.0620 1.1067 1.1055 1.0990 1.0787 1.1057 1.0595 1.0635 1.0957 1.0907 1.0919 1.1172 1.1153 1.0453 1.0635 1.0976
irintensity: 0.1069 0.5357 1.9324 1.5718 1.5493 0.1982 0.4930 0.5050 1.5906 7.4419 1.3577 1.4286 18.3158 24.9313 4.7684 2.9459 1.4422 0.1903 10.8765 5.9141 7.5899 0.2848 1.0385 3.1017 1.7015 3.4580 5.8632 6.7382 3.1413 5.2048 30.1405 2.4695 19.4563 11.3240 19.5279 51.3410 51.9986 108.4557 173.3745 3.9835 15.5630 14.5940 22.6017 2.1018 0.6881 4.6046 30.3178 2.8372 8.1756 12.6963 5.2118 31.1713 19.7697 4.6151 27.2394 27.9570 17.2218 43.4805 38.1256 7.7972 31.0157 5.6698 1.5349 151.3279 78.8994 35.8700 14.7814 160.2595 8.3107 4.2966 3.8102 17.0886 53.0700 46.7459 46.3881 5.8452 25.5062 19.9303 18.3491 1.6799 2.4169 16.4602 27.4791 34.1660 15.2436 99.5590 50.7111 16.5378 79.7660 50.4737 43.4979 19.0676 15.9702 57.9342 20.5033 490.4354 156.5880 15.9668 89.4607 139.9525 251.3368 43.3113 96.9223 254.7391 256.4168 207.8878 58.8985 46.8749 403.5527 62.8168 17.7721 39.2441 10.7653 64.9068 18.1779 12.1710 19.2568 13.4589 49.3686 17.8946 10.4160 12.2985 3.4186 31.5279 3.7835 29.0056 0.5310 38.7269 1.8936
temp: 298.150 k
press: 1.00000 atm
elementType: 9 8 8 8 7 7 7 6 6 6 6 6 6 6 6 6 6 6 6 6 6 6 6 6 6 1 1 1 1 1 1 1 1 1 1 1 1 1 1 1 1 1 1 1 1
symmnumber: 1
zpe: 930149.1 jmol-1
zpe.correction: 0.354275 hartree
zpe.thermalcorrener: 0.377630 hartree
zpe.thermalcorrenthalpy: 0.378574 hartree
zpe.thermalcorrgfe: 0.300939 hartree
zpe.sumelectzpe: -1185.810892 hartree
zpe.sumelectthermal: -1185.787537 hartree
zpe.sumelectthermalent: -1185.786593 hartree
zpe.sumelectthermalfe: -1185.864228 hartree
dipole: 10.4424 3.2787 -0.2580
dipole: 10.9480
quadrupole: -139.7366 -151.2866 -144.3666
quadrupole: -1.9135 -5.9507 -3.4977
quadrupole: 5.3933 -6.1567 0.7634 -1.9135 -5.9507 -3.4977
hfenergy: -1186.1651671 hartree
pointgroup: C01 [X(C18H20F1N3O3)]
dipole: 4.0904851 -1.3346931 0.1981528 debye
polarizability: 408.698223|2.7596672|245.8357017|-5.5887483|-1.752865|126.9462763 unknown
InChI: InChI=1S/C18H20FN3O3/c1-9-15-12(10-2-3-10)6-13(18(24)25)17(23)22(15)8-14(19)16(9)21-5-4-11(20)7-21/h6,8,10-11,24H,2-5,7,20H2,1H3
charge 0 multiplicity 1
45 atoms
F  1.957684 3.04666 0.160814
O  -2.780034 2.692581 0.100976
O  -5.401701 1.780039 -0.090864
O  -5.720922 -0.512218 -0.115069
N  3.105711 0.429786 -0.325935
N  -1.091669 1.04865 -0.115563
N  6.163108 -1.428085 0.522135
C  -1.219075 -2.794511 -0.147359
C  -0.448863 -3.33401 1.073177
C  -1.933233 -3.67841 0.889538
C  -1.582919 -1.331785 -0.245662
C  -0.607633 -0.273238 -0.297678
C  5.192861 -0.324927 0.569229
C  3.768591 -0.803495 0.18745
C  4.121166 1.497116 -0.608413
C  5.461897 0.740676 -0.519938
C  1.732067 0.622489 -0.298971
C  0.806593 -0.441866 -0.544332
C  -2.939791 -0.982531 -0.182794
C  1.139185 1.915784 -0.053967
C  -3.449963 0.33816 -0.123453
C  -0.214233 2.114517 -0.012264
C  -2.554476 1.458775 -0.03751
C  1.307592 -1.678484 -1.27428
C  -4.919924 0.467129 -0.106706
H  -1.000874 -3.30902 -1.091468
H  -0.1940 -2.619501 1.862317
H  0.292625 -4.123643 0.914526
H  -2.195368 -4.699552 0.597948
H  -2.650698 -3.202184 1.563992
H  5.142757 0.190079 1.558861
H  3.879607 -1.59347 -0.57852
H  3.195199 -1.212202 1.040153
H  4.072923 2.302821 0.144023
H  3.945946 1.947309 -1.60106
H  5.696872 0.221381 -1.467058
H  6.296944 1.416786 -0.26794
H  -3.687426 -1.783019 -0.162902
H  -0.685292 3.089443 0.139958
H  0.514093 -2.073502 -1.925242
H  1.642429 -2.501065 -0.618692
H  2.153346 -1.39131 -1.923181
H  6.025082 -2.149878 1.236445
H  7.140153 -1.123381 0.475457
H  -6.396835 1.726911 -0.084278
