program: Gaussian 09
title: 000178091
version: EM64L-G09RevD.01
frameworkgroup: C1[X(C20H25NO3)]
method: RPBEPBE
basis: SDD
operation: Freq
keyword: #p
keyword: freq=noraman
keyword: PBEPBE/SDD
title: #p freq=noraman PBEPBE/SDD
converged: YES YES NO NO
title: Mulliken charges:
elementType: O O O N C C C C C C C C C C C C C C C C C C C C H H H H H H H H H H H H H H H H H H H H H H H H H
charge: -0.262234 -0.271301 -0.280795 -0.330898 -0.338770 -0.464149 -0.469603 0.319235 0.008485 -0.468858 -0.382644 -0.015757 0.306279 0.121034 -0.659278 -0.719254 0.435240 -0.395333 -0.373722 -0.459198 -0.260862 -0.424392 -0.238546 -0.240403 0.275171 0.249073 0.261339 0.260760 0.249055 0.271219 0.230656 0.209558 0.232568 0.202143 0.248195 0.179976 0.200293 0.216899 0.223974 0.216142 0.205300 0.227787 0.289888 0.265492 0.236215 0.226372 0.236433 0.225912 0.225301
chargesum: 0.00000
title: Mulliken charges with hydrogens summed into heavy atoms:
elementType: O O O N C C C C C C C C C C C C C C C C C C C C
charge: -0.262234 -0.271301 -0.280795 -0.082703 -0.063599 0.046263 0.040211 0.319235 0.279704 -0.028644 0.052067 0.164220 0.306279 0.121034 -0.018112 -0.070025 0.435240 -0.105445 -0.108230 -0.222983 -0.034490 -0.187959 -0.012633 -0.015101
polarizability: 2.89406730e+02 -6.77741069e+00 1.99936096e+02 -1.80954110e+01 -2.18254837e+01 2.21113975e+02
1716.lowfreq: -21.7333 -12.9003 -4.5220 -0.0008 -0.0004 0.0001 5.0850 11.6093 20.4483
frequency: -19.2777 8.3449 20.4191 22.6586 32.1762 43.2465 60.8810 91.7890 92.8136 110.5874 138.1297 145.5127 171.3205 182.2249 186.5036 215.8254 227.8304 237.7872 247.5330 264.1268 270.4386 286.1541 342.7548 378.2724 400.1209 411.0323 421.4522 448.6794 464.8391 471.2505 492.1936 510.0376 534.8573 555.9669 572.4448 616.6433 639.4777 643.7829 650.8933 695.4812 715.4413 745.3023 775.3033 782.5971 783.5515 802.2787 803.0054 809.4408 812.9237 825.0516 835.2972 878.2196 882.6383 891.1922 902.1023 906.6488 915.1539 935.3871 949.1150 964.6915 966.1476 977.8853 979.8709 994.8021 1021.5098 1040.5657 1050.0792 1063.7658 1083.2581 1084.0863 1089.5849 1100.3189 1100.6265 1112.1092 1123.8624 1138.3177 1147.1667 1164.5267 1171.0167 1178.4071 1181.9841 1188.3013 1199.6272 1221.8483 1232.6699 1238.4401 1242.2567 1266.1029 1275.8080 1312.7848 1335.2070 1344.0411 1360.8196 1374.3213 1377.3804 1383.7106 1385.8595 1388.7962 1403.5060 1426.1512 1430.9898 1440.8244 1443.0483 1453.7136 1455.0338 1456.9302 1464.7891 1467.2765 1476.4821 1485.6205 1490.8013 1515.8710 1583.7726 1597.7867 1627.3270 1636.4239 2850.6526 2876.8774 2972.6924 2982.4450 3004.8020 3050.5666 3060.3297 3064.7339 3076.7538 3077.8293 3084.8566 3089.7721 3105.8138 3113.0465 3120.3811 3127.4651 3134.5200 3147.8269 3154.2978 3163.1370 3174.3754 3179.3170 3210.8177 3229.8638 3419.5652
redmass: 2.5163 4.2572 4.8356 4.1509 4.1274 3.5536 4.4932 5.1207 3.2518 3.8537 4.5792 3.3060 3.4173 2.5363 1.5146 3.8722 1.8419 1.4293 2.6416 4.3816 3.5943 5.1382 2.7574 3.0069 3.1002 3.4410 3.1582 3.5674 2.3686 3.3295 6.1626 5.9378 5.8988 3.7106 3.3373 5.5722 3.4745 2.9325 1.5747 5.1901 4.8268 1.3218 1.4646 4.0014 2.0001 2.1531 2.6970 2.0355 1.8518 2.2912 4.0151 1.5365 3.4263 1.7434 1.5334 1.8016 1.2953 3.8795 1.4884 1.3456 3.1853 1.3730 2.1687 1.3242 2.6751 1.8350 2.1264 1.8308 1.6688 1.4071 1.6839 2.3478 1.2060 1.9131 2.7783 2.2256 1.4814 1.9886 1.0831 1.3819 2.0026 1.3861 2.1078 1.3306 1.7709 2.2086 1.3737 1.7390 1.1726 1.3356 1.3926 1.3955 1.3281 1.2872 1.8927 1.8576 1.4928 1.2191 3.2558 5.2889 1.0872 2.2464 1.2172 1.3678 1.0888 2.3705 1.0524 1.1140 1.0789 1.0801 1.0638 3.8979 7.1085 5.5079 9.8245 6.9990 1.0823 1.0725 1.0363 1.0357 1.0618 1.0884 1.0882 1.0984 1.0977 1.0988 1.0996 1.0995 1.0505 1.0614 1.0859 1.0864 1.0902 1.0934 1.0964 1.0979 1.0969 1.0925 1.1182 1.1156 1.0741
irintensity: 0.1411 0.0194 0.1010 0.3284 1.3452 0.1141 2.0077 1.6079 0.9398 1.2317 1.5448 1.5260 2.9634 1.5319 0.7384 0.4881 0.9250 1.0813 1.6508 10.7799 2.3131 8.3779 0.4421 0.5421 4.7377 5.8031 6.4577 9.6769 6.4216 0.0739 10.8534 1.2174 6.9444 0.3603 14.4372 11.9082 0.9863 10.3960 68.5047 3.3480 11.9901 0.1716 33.7690 8.2973 60.2067 15.0076 7.8908 33.0920 134.7029 10.4030 183.8002 7.1258 98.3839 23.1240 2.7982 19.5509 6.0930 57.6208 0.7221 0.3428 19.8995 7.2943 12.6483 0.0918 45.6528 168.9921 22.6787 142.8838 24.2615 44.4145 48.4063 18.1468 4.5427 113.5196 197.1125 50.7818 24.4062 1.7047 1.7835 1.0315 43.0537 21.6845 0.7971 6.1001 30.9597 81.9920 15.4661 18.5507 3.9408 11.4071 22.8752 24.8761 10.1676 16.2510 37.2243 125.1918 5.8475 25.5231 23.1641 20.7560 11.1290 2.7082 18.1556 15.6087 15.4546 31.3374 1.1902 2.3569 6.2507 0.5113 25.2510 24.8084 51.6041 10.1534 122.6053 3.2901 84.9894 138.2636 36.9651 15.8917 25.2714 9.0245 9.1228 39.1332 12.0634 44.4988 23.2111 64.9168 14.3574 8.5775 0.9458 2.9107 17.0443 24.7734 34.1248 11.3022 15.0781 1.0773 0.2612 11.1363 2.2362
temp: 298.150 k
press: 1.00000 atm
elementType: 8 8 8 7 6 6 6 6 6 6 6 6 6 6 6 6 6 6 6 6 6 6 6 6 1 1 1 1 1 1 1 1 1 1 1 1 1 1 1 1 1 1 1 1 1 1 1 1 1
symmnumber: 1
zpe: 1067360.7 jmol-1
zpe.correction: 0.406536 hartree
zpe.thermalcorrener: 0.429616 hartree
zpe.thermalcorrenthalpy: 0.430560 hartree
zpe.thermalcorrgfe: 0.350556 hartree
zpe.sumelectzpe: -1055.737440 hartree
zpe.sumelectthermal: -1055.714361 hartree
zpe.sumelectthermalent: -1055.713417 hartree
zpe.sumelectthermalfe: -1055.793420 hartree
dipole: -1.4087 0.7485 -1.2362
dipole: 2.0181
quadrupole: -129.6417 -129.5357 -139.0426
quadrupole: 0.9552 5.4796 -4.4204
quadrupole: 3.0983 3.2043 -6.3026 0.9552 5.4796 -4.4204
hfenergy: -1056.1439763 hartree
pointgroup: C01 [X(C20H25N1O3)]
dipole: -0.4947512 -0.4678983 0.4083169 debye
polarizability: 277.4732798|25.453773|211.9341235|29.4296889|-16.1742609|221.0493981 unknown
InChI: InChI=1S/C20H25NO3/c1-14(2)21-13-12-19(24-20(22)16-10-11-16)23-18-9-5-7-15-6-3-4-8-17(15)18/h3-9,14,16,19,21H,10-13H2,1-2H3
charge 0 multiplicity 1
49 atoms
O  -2.190291 0.110093 0.981846
O  -2.966455 0.14698 -1.235191
O  0.174379 -0.142041 0.966534
N  -0.279925 -3.56969 -0.213532
C  -4.087405 1.449643 0.501801
C  -4.58949 2.582026 -0.430722
C  -5.500433 1.403948 -0.134921
C  -3.060678 0.525666 -0.040309
C  -1.062371 -0.809668 0.631899
C  -1.166793 -2.03709 1.531649
C  -0.096127 -3.089203 1.173817
C  0.842007 -4.356999 -0.798213
C  0.767075 0.771088 0.061514
C  2.003379 1.34159 0.535045
C  2.013092 -3.42689 -1.185802
C  0.317237 -5.119684 -2.031876
C  2.705703 2.270325 -0.325617
C  0.241772 1.106928 -1.189307
C  2.552872 1.01859 1.818054
C  2.155795 2.597959 -1.609717
C  0.952265 2.026936 -2.022623
C  3.939498 2.837243 0.137573
C  3.757235 1.589645 2.238614
C  4.457499 2.505775 1.391613
H  -4.005362 1.659152 1.569491
H  -4.795788 3.546261 0.040802
H  -4.128858 2.628859 -1.420871
H  -5.646161 0.667251 -0.929397
H  -6.347093 1.543533 0.542288
H  -1.116775 -1.072475 -0.438802
H  -1.055894 -1.721202 2.58496
H  -2.180609 -2.465703 1.414187
H  0.899175 -2.618632 1.253838
H  -0.128373 -3.911088 1.930572
H  -1.173126 -4.073937 -0.313202
H  1.224457 -5.109705 -0.061988
H  2.853644 -4.015424 -1.598243
H  2.395041 -2.858764 -0.31888
H  1.678072 -2.698923 -1.946406
H  1.129204 -5.695721 -2.509501
H  -0.48604 -5.830465 -1.756173
H  -0.088667 -4.407474 -2.773676
H  -0.702902 0.687794 -1.547115
H  2.006812 0.322086 2.459953
H  2.691786 3.301809 -2.256398
H  0.529002 2.278439 -3.001152
H  4.471524 3.540422 -0.514479
H  4.169219 1.338519 3.222313
H  5.400872 2.947113 1.73215
