program: Gaussian 09
title: 000012856
version: EM64L-G09RevD.01
frameworkgroup: C1[X(C12H8N2S)]
method: RPBEPBE
basis: SDD
operation: Freq
keyword: #p
keyword: freq=noraman
keyword: PBEPBE/SDD
title: #p freq=noraman PBEPBE/SDD
converged: YES YES YES YES
title: Mulliken charges:
elementType: S N N C C C C C C C C C C C C H H H H H H H H
charge: 0.320868 -0.030034 -0.045897 -0.363283 0.330728 -0.341303 0.234361 -0.275463 -0.348331 -0.236852 -0.214059 -0.283130 -0.189773 -0.168023 -0.360676 0.246624 0.258169 0.230849 0.231714 0.278390 0.243175 0.234998 0.246949
chargesum: 0.00000
title: Mulliken charges with hydrogens summed into heavy atoms:
elementType: S N N C C C C C C C C C C C C
charge: 0.320868 -0.030034 -0.045897 -0.363283 0.330728 -0.341303 0.234361 -0.028838 -0.090162 -0.006004 0.017655 -0.004740 0.053402 0.066975 -0.113727
polarizability: 3.06945804e+02 4.26571884e+00 1.56356412e+02 -1.31312961e-04 7.94240346e-04 5.83036664e+01
1716.lowfreq: -7.9502 -5.7961 -0.0013 -0.0010 0.0006 3.9723 58.9437 62.6286 92.0768
frequency: 58.9402 62.6222 92.0756 162.4255 194.9064 264.3132 298.9372 299.1973 402.4420 404.2075 431.7743 467.4066 488.6907 554.8567 564.7610 608.1874 615.7279 652.3151 677.7387 687.3353 736.1375 747.0839 768.7708 796.7078 844.5965 864.6734 909.3598 926.0409 949.4221 964.0201 965.5525 986.4818 1007.1261 1014.4242 1034.9552 1045.3635 1085.2630 1118.2081 1161.7247 1169.6833 1212.4275 1258.7404 1281.5928 1298.8064 1324.2271 1377.1223 1411.7139 1429.7198 1440.5893 1446.8951 1525.5592 1558.9400 1563.5570 1576.1865 1607.0086 3134.8906 3135.8928 3146.8166 3149.9985 3164.0497 3168.5583 3174.9941 3179.9909
redmass: 4.9685 5.3641 5.6424 5.2874 5.8741 7.7137 6.0756 5.2655 3.3723 10.1791 3.2447 4.0885 8.7950 3.5964 8.3894 7.8357 5.3924 8.6777 7.5989 7.1611 2.4265 1.9197 1.6602 2.0336 6.6701 1.3975 1.3102 7.7512 1.3827 7.0242 1.4472 1.3209 1.3404 2.2195 2.3923 4.4747 1.6348 1.5339 1.0777 1.1442 3.1268 1.7346 1.5353 2.8700 10.3751 4.4781 1.9563 2.9869 2.2368 2.6288 9.9181 5.9355 6.1589 5.7592 7.3136 1.0882 1.0857 1.0903 1.0902 1.0956 1.0956 1.0998 1.1001
irintensity: 0.1287 5.1423 4.9017 0.2088 1.8920 0.7148 3.7840 0.0062 2.8394 0.0090 6.7712 7.8592 0.2839 2.4472 3.8009 10.1161 2.7418 11.3275 5.7738 10.0800 15.0749 51.0459 60.0962 51.1722 4.6089 1.0978 0.4603 46.4114 2.6086 5.1591 1.8493 0.0303 0.4469 7.0221 2.8629 3.8389 6.2273 4.6394 1.6086 0.9533 4.1507 8.0174 1.9536 14.2471 0.8182 18.0921 20.8214 15.6872 36.6973 20.8911 18.9099 17.2876 2.8473 49.1835 2.0167 14.0923 1.6542 12.7097 8.2206 18.1212 22.2653 24.8613 14.7926
temp: 298.150 k
press: 1.00000 atm
elementType: 16 7 7 6 6 6 6 6 6 6 6 6 6 6 6 1 1 1 1 1 1 1 1
symmnumber: 1
zpe: 440541.2 jmol-1
zpe.correction: 0.167793 hartree
zpe.thermalcorrener: 0.179018 hartree
zpe.thermalcorrenthalpy: 0.179962 hartree
zpe.thermalcorrgfe: 0.129716 hartree
zpe.sumelectzpe: -968.633147 hartree
zpe.sumelectthermal: -968.621922 hartree
zpe.sumelectthermalent: -968.620978 hartree
zpe.sumelectthermalfe: -968.671224 hartree
dipole: -0.9990 1.1219 0.0002
dipole: 1.5023
quadrupole: -63.8441 -88.2220 -99.0749
quadrupole: -4.1075 -0.0048 0.0011
quadrupole: 19.8696 -4.5083 -15.3613 -4.1075 -0.0048 0.0011
hfenergy: -968.8009403 hartree
pointgroup: C01 [X(C12H8N2S1)]
dipole: -0.3883971 -0.4451913 -0.016481 debye
dipolederiv: -0.0678988 -0.0994577 -0.0037999 -0.2198868 -0.3473738 -0.0163823 -0.0080523 -0.0162153 0.1033618 -0.2131395 0.2536463 0.0089316 0.0049529 -0.6707566 -0.0174805 0.0000306 -0.0169984 -0.1783089 -0.5124196 0.0225206 0.000088 0.1275968 -0.2850541 -0.0026094 0.0038504 -0.0027641 -0.2039521 0.2215849 -0.2217109 -0.0073191 -0.1047669 -0.0529549 0.0013418 -0.0031587 0.0011721 -0.0953147 -0.0127549 -0.1403119 -0.005125 -0.0090874 -0.0186115 -0.0033374 -0.0004723 -0.0036036 0.0747069 0.1403453 0.1246069 0.0047114 0.5165481 0.8954329 0.0341295 0.0185713 0.0334031 -0.0412408 0.7393868 -0.0087906 0.0008803 0.0696324 -0.0070457 -0.002227 0.0038164 -0.0022485 0.0565104 -0.0868043 0.1256089 0.0045383 0.1751112 0.0887983 0.0078529 0.0062889 0.0077801 -0.1224741 0.1868148 0.0711193 0.0031073 -0.0687999 0.0903981 0.0084063 -0.0018366 0.0087463 -0.1488122 -0.0492048 0.034183 0.0014442 0.1315069 0.0891039 0.0090808 0.0048973 0.0088939 -0.1600605 -0.1102668 -0.1380761 -0.0048064 -0.2969739 -0.0364802 0.0041851 -0.0104228 0.0044118 -0.1684622 -0.4843185 -0.0913296 -0.0039191 -0.2543707 -0.0294937 0.0015435 -0.009633 0.0019086 -0.0832179 0.3057132 0.0854464 0.0037049 0.0249478 0.1717551 0.0103965 0.0014221 0.0104166 -0.1207672 -0.0814475 -0.0528122 -0.0017273 0.2839904 -0.2142297 -0.0030768 0.0101363 -0.0035673 -0.1133137 0.0581371 -0.0386922 -0.0009761 -0.4624684 0.3307529 0.013189 -0.0157446 0.0135578 -0.0690263 0.0779828 0.0059915 0.0000436 -0.0630835 -0.0606432 -0.00815 -0.0024246 -0.0080373 0.1648136 0.0879353 -0.0465541 -0.0017892 0.008282 -0.0504261 -0.0077908 0.0001689 -0.0079391 0.1685849 -0.1192084 -0.0683017 -0.0029301 -0.0666712 0.0630269 -0.0037162 -0.0028704 -0.0037014 0.1637476 -0.0724452 0.1024591 0.0032314 0.1146176 0.0111517 -0.0052152 0.0036223 -0.005219 0.1634733 0.1032726 0.0810254 0.0027988 0.0685715 0.0249524 -0.0046794 0.0023544 -0.0047075 0.1602254 0.0207891 -0.0813956 -0.0031008 -0.1107445 -0.0442847 -0.0069756 -0.0041008 -0.0069721 0.1484088 -0.1258018 0.0104881 -0.0001632 -0.0023411 0.101714 -0.0022739 -0.0005639 -0.0022472 0.1659329 -0.0062517 0.0703371 0.0021762 0.1334369 -0.049732 -0.0062107 0.0041211 -0.0060694 0.1351852 unknown
polarizability: 307.0179993|-2.698533|156.1613852|0.3283167|3.4567759|58.4264971 unknown
InChI: InChI=1S/C12H8N2S/c1-2-7-11-9(5-1)14-12(15-11)10-6-3-4-8-13-10/h1-8H
charge 0 multiplicity 1
23 atoms
S  0.441769 1.72548 0.048221
N  0.453222 -0.977816 -0.04753
N  -2.495845 1.19198 0.024006
C  2.019892 0.835801 0.019271
C  1.801929 -0.58344 -0.031254
C  -0.366095 0.058964 -0.01226
C  -1.831155 -0.007602 -0.017116
C  3.322293 1.373562 0.040863
C  2.908718 -1.467527 -0.060626
C  4.414224 0.477907 0.010989
C  4.208679 -0.929218 -0.039435
C  -2.501863 -1.259489 -0.062162
C  -3.911017 -1.266864 -0.064731
C  -4.606973 -0.034941 -0.022705
C  -3.855971 1.163946 0.021126
H  3.491374 2.453924 0.079691
H  2.730516 -2.546108 -0.099328
H  5.434697 0.875665 0.026988
H  5.074343 -1.599624 -0.061746
H  -1.909921 -2.178183 -0.093898
H  -4.458822 -2.2143 -0.09903
H  -5.700617 0.000829 -0.023597
H  -4.353778 2.139452 0.053763
