program: Gaussian 09
title: 000178082
version: EM64L-G09RevD.01
frameworkgroup: C1[X(C14H17FN2O9)]
method: RPBEPBE
basis: SDD
operation: Freq
keyword: #p
keyword: freq=noraman
keyword: PBEPBE/SDD
title: #p freq=noraman PBEPBE/SDD
converged: YES YES NO NO
title: Mulliken charges:
elementType: F O O O O O O O O O N N C C C C C C C C C C C C C C H H H H H H H H H H H H H H H H H
charge: -0.161454 -0.249258 -0.267319 -0.427386 -0.442435 -0.307888 -0.225515 -0.212740 -0.417148 -0.227404 -0.185329 -0.406263 -0.119958 -0.132135 -0.089430 -0.088186 -0.362998 0.269847 -0.178482 0.294945 -0.520976 0.168083 -0.371075 0.105086 -0.473009 0.178357 0.276904 0.228218 0.286155 0.298680 0.226158 0.201186 0.388074 0.352194 0.252860 0.244476 0.361411 0.371535 0.235321 0.247111 0.248584 0.253203 0.378002
chargesum: 0.00000
title: Mulliken charges with hydrogens summed into heavy atoms:
elementType: F O O O O O O O O O N N C C C C C C C C C C C C C C
charge: -0.161454 -0.249258 -0.267319 -0.039311 -0.081024 -0.307888 -0.225515 -0.212740 -0.039146 -0.227404 -0.185329 -0.034728 0.156946 0.096083 0.196725 0.210494 0.064346 0.269847 0.173712 0.294945 -0.023640 0.168083 0.111357 0.105086 0.028778 0.178357
polarizability: 2.83749717e+02 3.55673761e+00 1.76338206e+02 -2.05722110e+00 4.61888766e-01 1.31458997e+02
1716.lowfreq: -5.6103 -2.2797 -0.0005 -0.0004 0.0006 4.8625 9.4949 15.1885 18.5737
frequency: 9.3181 15.1783 18.5634 39.5740 45.1883 48.9314 55.7080 67.5836 74.5346 78.6522 103.2411 107.8819 134.0161 150.6458 160.0545 171.3642 191.9206 195.1064 245.2477 263.9226 269.6583 281.7529 289.5089 306.5769 319.9792 331.6859 339.4136 380.3022 385.0430 410.1151 421.4793 456.9803 466.1326 502.3610 506.2178 542.1942 549.9285 592.2767 598.9481 623.5460 634.8078 643.7045 659.3327 676.2414 692.9445 711.1305 721.7726 736.9275 742.4306 771.4292 774.9756 801.1561 839.9031 852.6468 859.0924 895.2159 904.0836 928.5271 957.8225 972.8527 1002.3203 1008.9417 1025.3267 1050.8557 1053.2254 1058.0278 1070.8553 1075.6996 1080.6145 1085.4804 1090.8340 1109.1648 1118.7224 1154.4288 1191.0273 1210.9560 1228.4317 1235.8369 1238.2164 1245.4723 1250.5265 1251.7202 1256.8660 1277.4755 1280.8465 1286.2990 1314.3877 1319.4766 1333.6029 1344.1419 1353.0207 1359.6298 1364.4233 1380.9915 1398.9918 1408.3124 1418.6395 1436.5560 1443.5699 1472.3145 1477.9867 1609.1392 1634.6923 1662.9166 1665.1351 1671.3345 2940.3032 2949.6606 2983.5080 2984.8438 2998.1263 3021.8545 3040.0283 3044.1783 3048.8526 3051.1501 3087.6927 3100.3993 3146.3906 3401.8729 3512.6930 3520.1692 3578.9782
redmass: 7.5529 9.1712 9.6736 4.5858 7.5745 6.7388 2.6367 6.5092 5.1842 5.4028 5.9835 2.8321 7.2406 6.8040 3.4572 8.8516 7.1625 5.8799 7.2896 7.1105 6.6861 1.2178 6.9857 6.0532 9.5846 6.4540 5.4693 5.8531 10.6077 4.1912 4.7237 6.3482 6.2510 3.2171 1.9330 4.0277 4.9580 5.7263 4.5392 2.4651 1.4264 1.3518 5.5362 6.2535 2.2171 10.1808 4.7902 1.9060 2.4712 5.5255 2.0998 3.6640 2.4715 2.7645 3.7439 3.5800 4.0537 1.3663 5.2700 2.0232 3.6909 5.4112 3.4999 4.0624 3.9771 2.3352 2.9057 3.5453 2.5564 2.6056 2.9068 2.6725 7.3908 1.3308 1.1412 4.7316 1.2246 1.3818 1.4050 1.2539 1.3293 1.2511 2.0261 1.2658 1.4437 1.1553 1.4269 1.5734 1.2533 1.4255 1.7444 1.6809 1.7956 1.8316 1.9089 3.3364 1.4427 1.0895 1.0760 1.0780 1.0865 5.8170 9.8320 7.0381 9.4776 8.5119 1.0606 1.0794 1.0639 1.0633 1.1045 1.0611 1.0950 1.0871 1.0961 1.0860 1.1030 1.0887 1.0954 1.0647 1.0639 1.0772 1.0668
irintensity: 0.8400 1.2626 0.3571 0.2550 0.4361 1.4965 2.3395 1.9389 1.8620 0.8439 9.5464 0.8420 2.9255 6.4171 12.3632 3.8490 1.9689 2.1314 2.9036 10.4238 11.9498 133.0428 13.1127 14.8031 14.7819 3.0951 9.0172 0.6570 14.2361 14.3142 14.1869 6.9874 23.6211 42.5669 29.2540 17.4862 26.0094 4.8498 15.4544 67.4580 69.9189 127.0948 4.9637 5.9476 5.1140 5.0366 32.7161 13.5298 34.5201 44.9417 125.1819 10.4792 11.9726 6.2321 2.4607 0.2651 13.5190 42.4405 108.1697 49.4620 116.6829 64.9943 108.8611 70.5826 115.9402 74.6898 38.0221 183.3028 1.2411 192.4916 84.3077 158.5219 64.3417 19.8055 29.2433 18.7848 2.9809 9.4507 37.5040 130.4124 56.0287 1.9618 156.1239 7.9006 94.7301 30.8374 3.4863 49.9083 3.9482 9.3020 0.6032 4.9292 35.0803 50.2220 64.1162 85.2195 1.6391 7.4049 37.0691 7.5493 16.9182 376.6561 44.3610 612.2985 107.2726 269.5841 37.6034 47.0956 9.2842 9.1379 50.4976 9.9387 4.8001 9.5498 1.7584 20.0761 25.3669 14.0231 69.0963 174.2277 22.2398 70.3288 12.4915
temp: 298.150 k
press: 1.00000 atm
elementType: 9 8 8 8 8 8 8 8 8 8 7 7 6 6 6 6 6 6 6 6 6 6 6 6 6 6 1 1 1 1 1 1 1 1 1 1 1 1 1 1 1 1 1
symmnumber: 1
zpe: 831080.8 jmol-1
zpe.correction: 0.316542 hartree
zpe.thermalcorrener: 0.342317 hartree
zpe.thermalcorrenthalpy: 0.343261 hartree
zpe.thermalcorrgfe: 0.255675 hartree
zpe.sumelectzpe: -1428.083788 hartree
zpe.sumelectthermal: -1428.058013 hartree
zpe.sumelectthermalent: -1428.057069 hartree
zpe.sumelectthermalfe: -1428.144655 hartree
dipole: -2.1407 1.8274 -0.2806
dipole: 2.8285
quadrupole: -189.8200 -140.0262 -155.3997
quadrupole: 14.6458 22.2678 7.3074
quadrupole: -28.0714 21.7225 6.3489 14.6458 22.2678 7.3074
hfenergy: -1428.4003301 hartree
pointgroup: C01 [X(C14H17F1N2O9)]
dipole: 0.8912747 -0.6354725 -0.2004743 debye
polarizability: 282.6944247|10.5672398|176.4913475|4.3063665|6.3045512|132.3611475 unknown
InChI: InChI=1S/C14H17FN2O9/c15-6-4-17(14(24)16-12(6)23)13-10(22)11(7(5-18)25-13)26-9(21)3-1-2-8(19)20/h4,7,10-11,13,16,18-19,22H,1-3,5H2
charge 0 multiplicity 1
43 atoms
F  -6.032949 -1.339179 -0.812802
O  -1.15661 -1.014934 -1.209922
O  1.626104 -0.580352 -0.165106
O  0.211441 1.364289 1.097417
O  -2.177683 -3.537006 -0.575255
O  -2.36357 2.43203 0.822031
O  2.870637 -0.615333 1.815324
O  -6.853853 1.125201 0.434753
O  8.47179 2.008921 -0.579533
O  8.107796 0.115249 0.713655
N  -2.842128 0.378333 -0.206962
N  -4.59361 1.739987 0.590795
C  0.440842 -1.042314 0.577436
C  -0.518188 0.153737 0.829847
C  -0.370073 -1.957333 -0.353385
C  -1.364213 0.21579 -0.488491
C  -1.290171 -2.919853 0.414637
C  -3.216661 1.57459 0.426502
C  -3.773791 -0.575447 -0.617188
C  2.771885 -0.293965 0.614862
C  3.798494 0.431345 -0.230201
C  -5.112996 -0.371082 -0.412989
C  5.228827 0.312149 0.33199
C  -5.649341 0.840769 0.214863
C  6.20816 1.20142 -0.45635
C  7.649608 1.01535 -0.02202
H  0.76711 -1.517115 1.520014
H  -1.191976 -0.10957 1.675107
H  0.267824 -2.518349 -1.053301
H  -1.044359 1.069472 -1.112704
H  -0.653482 -3.675706 0.921169
H  -1.877876 -2.379385 1.188323
H  -0.479607 2.085984 1.161117
H  -3.36754 -1.477996 -1.087886
H  3.478136 1.493362 -0.260582
H  3.729562 0.061982 -1.269675
H  -2.672924 -4.287181 -0.161131
H  -4.889122 2.60972 1.047448
H  5.568602 -0.738339 0.294973
H  5.231629 0.595304 1.399217
H  6.162995 0.97705 -1.541843
H  5.953608 2.273789 -0.36109
H  9.413276 1.850416 -0.296063
