program: Gaussian 09
title: 000178032
version: EM64L-G09RevD.01
frameworkgroup: C1[X(C10H15N3O)]
method: RPBEPBE
basis: SDD
operation: Freq
keyword: #p
keyword: freq=noraman
keyword: PBEPBE/SDD
title: #p freq=noraman PBEPBE/SDD
converged: YES YES NO NO
title: Mulliken charges:
elementType: O N N N C C C C C C C C C C H H H H H H H H H H H H H H H
charge: -0.244038 0.006624 -0.003846 -0.000474 -0.159228 -0.135544 -0.464732 -0.481303 -0.518445 -0.446507 -0.439036 0.080190 -0.191935 -0.486765 0.247992 0.240133 0.233627 0.211211 0.216749 0.220425 0.228867 0.267641 0.238090 0.226016 0.226855 0.229656 0.230773 0.234335 0.232670
chargesum: 0.00000
title: Mulliken charges with hydrogens summed into heavy atoms:
elementType: O N N N C C C C C C C C C C
charge: -0.244038 0.006624 -0.003846 -0.000474 0.088764 0.104588 -0.019894 -0.044130 -0.021937 0.017599 0.017475 0.080190 -0.191935 0.211013
polarizability: 1.54379656e+02 -4.98083018e+00 1.36403993e+02 3.04298319e+00 2.20858838e-01 9.67105580e+01
1716.lowfreq: -5.4178 0.0006 0.0007 0.0009 1.3831 11.0305 24.1086 37.8136 80.1049
frequency: 23.6626 36.3605 80.0980 97.3898 113.5771 130.5249 165.2899 227.5424 262.3937 285.6688 301.2896 325.4871 383.5533 404.8355 410.4940 448.0850 532.0273 571.1398 589.2145 620.0532 693.6231 749.3870 779.0279 798.2756 807.8343 815.7943 859.8880 874.2691 895.2289 941.2109 957.1079 985.5731 990.4148 1003.1433 1018.1612 1044.2278 1070.2904 1099.7547 1111.4298 1125.5452 1141.9069 1160.7565 1188.4402 1195.8452 1218.5747 1227.1911 1254.7561 1294.3209 1305.7377 1308.9686 1311.4262 1316.0117 1321.7122 1329.9854 1347.3613 1350.1831 1420.5247 1449.6263 1457.7963 1461.7701 1468.8089 1470.2234 1471.6957 1482.1260 1525.8941 2157.2304 2981.7730 2982.9898 2991.3221 2991.9107 3000.9357 3006.2268 3013.0636 3030.4736 3037.7231 3045.8838 3066.3356 3075.0506 3085.4497 3096.1969 3132.1224
redmass: 4.3468 2.8707 2.6012 2.1043 4.6687 3.1189 1.8013 2.8536 2.7946 9.5026 2.9501 4.3171 2.4708 2.6265 3.1547 5.2695 4.4729 3.8049 7.3923 5.1328 6.3821 4.6925 2.6490 1.5806 2.1627 2.2012 2.9323 3.0534 3.9106 2.2858 2.5676 2.7131 5.0310 3.2697 3.3489 3.1018 2.7357 1.6712 1.2494 1.5222 1.5073 1.3655 1.2954 2.7799 1.2602 1.1366 1.4162 1.3432 1.3018 1.5323 1.3386 1.3877 1.3700 1.2855 1.4130 1.4057 1.1339 1.0524 1.0780 1.0805 1.0816 1.0565 1.0837 1.0927 7.0448 12.6606 1.0833 1.0596 1.0293 1.0594 1.0609 1.0618 1.0629 1.0855 1.1041 1.1036 1.1058 1.1058 1.1041 1.1057 1.1032
irintensity: 2.9562 0.4727 1.2739 1.1203 1.7318 1.0846 5.5830 1.2657 0.8592 2.3313 2.7637 1.0134 12.5012 2.4268 4.4126 1.3571 0.5159 2.7647 8.9962 2.0581 1.2174 29.2437 19.2214 1.9759 8.3481 35.1008 24.5356 0.5785 32.7516 10.6826 12.3595 67.7382 89.9360 3.8606 18.3517 10.9300 11.7869 3.8493 0.1245 14.4119 12.1098 10.7208 12.8112 13.5901 3.1154 1.8872 10.0271 3.9791 1.4468 4.9780 5.5282 2.2148 0.6326 0.7119 2.7061 0.4079 0.3677 14.4889 3.4350 5.3542 15.2716 27.0360 20.9364 3.7231 1.5301 7.9259 15.3015 27.4868 66.5872 19.4426 85.6109 77.1366 49.6725 23.4098 4.4108 4.3823 31.9348 70.3066 15.2373 37.1415 13.9537
temp: 298.150 k
press: 1.00000 atm
elementType: 8 7 7 7 6 6 6 6 6 6 6 6 6 6 1 1 1 1 1 1 1 1 1 1 1 1 1 1 1
symmnumber: 1
zpe: 632855.7 jmol-1
zpe.correction: 0.241042 hartree
zpe.thermalcorrener: 0.254601 hartree
zpe.thermalcorrenthalpy: 0.255545 hartree
zpe.thermalcorrgfe: 0.199481 hartree
zpe.sumelectzpe: -628.364043 hartree
zpe.sumelectthermal: -628.350484 hartree
zpe.sumelectthermalent: -628.349540 hartree
zpe.sumelectthermalfe: -628.405604 hartree
dipole: -1.2600 -2.5547 0.4102
dipole: 2.8779
quadrupole: -80.8897 -92.2818 -81.6455
quadrupole: -18.8473 -2.8673 -4.3264
quadrupole: 4.0493 -7.3428 3.2935 -18.8473 -2.8673 -4.3264
hfenergy: -628.6050854 hartree
pointgroup: C01 [X(C10H15N3O1)]
dipole: -0.584131 -0.9676806 0.0663475 debye
polarizability: 153.2674893|-6.7928562|137.1116877|3.3265414|3.4647597|97.1150299 unknown
InChI: InChI=1S/C10H15N3O/c1-14-12-10(6-11)9-7-13-4-2-8(9)3-5-13/h8-9H,2-5,7H2,1H3
charge 0 multiplicity 1
29 atoms
O  3.040151 -0.811962 0.121195
N  -2.287674 -0.941956 -0.705749
N  1.643216 -0.79234 -0.245675
N  2.518552 2.594373 0.441759
C  -1.170457 0.855033 0.804703
C  -0.329981 0.663139 -0.511812
C  -1.273317 -0.491275 1.570088
C  -2.594447 1.31986 0.392323
C  -1.017814 -0.495052 -1.339171
C  -1.994974 -1.531919 0.636814
C  -3.2129 0.221248 -0.549493
C  1.14443 0.434932 -0.205774
C  1.924088 1.596121 0.154426
C  3.53681 -2.197898 0.013403
H  -0.692888 1.621941 1.441403
H  -0.393165 1.616843 -1.073157
H  -0.267684 -0.847139 1.858574
H  -1.842847 -0.33272 2.504845
H  -3.208616 1.454261 1.302654
H  -2.543686 2.301676 -0.115831
H  -1.244787 -0.143029 -2.361311
H  -0.345426 -1.364899 -1.415586
H  -1.368999 -2.428322 0.482921
H  -2.954263 -1.863637 1.073542
H  -4.16955 -0.156671 -0.146203
H  -3.416368 0.628006 -1.556888
H  2.978534 -2.863484 0.69418
H  4.593599 -2.133596 0.315606
H  3.452562 -2.559834 -1.025784
