program: Gaussian 09
title: 000178084
version: EM64L-G09RevD.01
frameworkgroup: C1[X(C21H29NO2)]
method: RPBEPBE
basis: SDD
operation: Freq
keyword: #p
keyword: freq=noraman
keyword: PBEPBE/SDD
title: #p freq=noraman PBEPBE/SDD
converged: YES YES NO NO
title: Mulliken charges:
elementType: O O N C C C C C C C C C C C C C C C C C C C C C H H H H H H H H H H H H H H H H H H H H H H H H H H H H H
charge: -0.259873 -0.265608 -0.094452 -0.197946 -0.086161 -0.575778 -0.173767 0.018302 -0.480399 0.265156 -0.368129 -0.466970 0.419083 -0.470884 -0.447605 -0.544365 -0.076554 -0.578137 -0.386870 0.163888 -0.023823 -0.206692 -0.716468 -0.716786 0.233699 0.211980 0.210486 0.225168 0.225328 0.221577 0.228284 0.186112 0.219452 0.228307 0.213582 0.219032 0.214736 0.234071 0.204285 0.208949 0.216647 0.254052 0.195974 0.191392 0.194578 0.225742 0.238043 0.225645 0.204067 0.209166 0.206511 0.212366 0.211603
chargesum: 0.00000
title: Mulliken charges with hydrogens summed into heavy atoms:
elementType: O O N C C C C C C C C C C C C C C C C C C C C C
charge: -0.259873 -0.265608 -0.094452 0.035752 0.125819 -0.140123 0.051561 0.018302 -0.030537 0.265156 0.037436 -0.025081 0.419083 -0.037116 -0.009249 -0.118769 -0.076554 -0.324085 0.000497 0.163888 0.170755 0.257094 -0.077590 -0.086306
polarizability: 2.70586479e+02 1.49701198e+01 2.53657681e+02 -1.84902936e+01 3.61083652e+00 1.76594598e+02
1716.lowfreq: -14.1061 -9.5281 -6.4797 -0.0003 0.0005 0.0009 25.3750 39.1080 41.0196
frequency: 24.5944 38.9068 40.9334 42.9141 57.2173 91.0933 107.3587 122.6710 134.0947 154.8551 162.5420 169.1968 204.4803 216.6395 226.6456 236.3166 243.0226 249.1540 281.6673 291.3004 326.1074 349.7197 374.5906 381.2767 405.6969 418.7222 431.0093 444.7902 457.5603 481.2906 518.1841 540.9784 559.0947 582.5368 593.8483 639.2585 668.8068 682.5003 711.1437 722.3215 742.5146 757.6915 784.5129 815.0753 829.1814 833.9691 837.3655 860.8930 869.0959 877.9892 893.4355 899.0701 914.0048 920.2332 931.4101 940.9828 942.2926 957.5337 966.7818 976.1811 990.5355 1014.1317 1028.7155 1036.1713 1043.8221 1047.2363 1065.6310 1074.0474 1085.1239 1094.9135 1109.7020 1117.5342 1131.5929 1134.8372 1142.9145 1158.6085 1174.9656 1177.1724 1180.6502 1193.1577 1200.6941 1210.8056 1213.4587 1224.3584 1233.2612 1256.1799 1260.3650 1270.1154 1273.8605 1280.6171 1287.9584 1292.4224 1302.3756 1307.0577 1316.2961 1320.9675 1321.7089 1325.5558 1333.1137 1345.9614 1350.5048 1360.9022 1362.6621 1373.7966 1375.2341 1393.4633 1406.9547 1428.2278 1452.8027 1455.0257 1455.6142 1465.0510 1467.2876 1468.8867 1470.5574 1472.2495 1474.7163 1475.8831 1481.2453 1483.3094 1489.8605 1502.6547 1619.1545 1642.3178 2901.1141 2922.6539 2940.8361 2946.8881 2947.1871 2955.0780 2964.6748 2965.6666 2970.2774 2982.6030 2984.2156 2984.8192 2985.2705 2993.0308 3001.2106 3001.4459 3007.5587 3007.8518 3040.4168 3045.7886 3057.8567 3060.0004 3063.4250 3064.5695 3066.9312 3073.0671 3077.1091 3111.4462 3156.9325
redmass: 3.9519 2.5479 3.8174 4.1571 2.7458 2.7930 2.8452 2.4578 3.7738 3.4175 3.6730 2.4547 2.4342 1.1137 2.2792 2.7797 3.4526 1.1958 4.2851 4.4909 3.4774 4.8001 2.3311 2.2432 3.5520 2.2631 2.8589 2.5744 4.4880 3.5619 3.5657 2.7827 3.8623 3.4956 2.8654 4.0658 4.1935 7.7850 3.2330 6.1871 2.2033 2.6631 2.3959 2.4320 5.0025 1.9713 3.6725 1.6444 2.2738 2.6002 1.6123 2.8382 1.1755 1.9301 2.0447 2.3840 1.7017 1.5762 4.7497 1.9839 3.9784 2.3815 2.2081 2.1365 2.7544 2.7426 2.0615 1.5215 2.0886 2.6234 1.6505 1.6658 1.8954 1.1557 2.2443 1.4128 1.7349 1.7492 1.8502 1.8542 1.6958 1.4374 1.6005 1.2968 1.4518 2.7054 1.2622 1.4155 1.2949 1.4211 1.3318 1.4333 1.2523 1.3722 1.5364 1.3560 1.3331 1.6193 1.4114 1.3461 1.5441 1.2955 1.4355 1.4716 1.2151 1.2154 5.1016 4.2669 1.4473 1.2091 1.8214 1.0896 1.0539 1.0972 1.0766 1.0845 1.0926 1.0912 1.1868 1.0584 1.0482 1.0859 8.9054 10.6873 1.0833 1.0673 1.0821 1.0617 1.0651 1.0763 1.0374 1.0637 1.0363 1.0640 1.0777 1.0758 1.0889 1.0604 1.0954 1.0835 1.0687 1.0661 1.1014 1.1016 1.0994 1.1020 1.1019 1.0998 1.0990 1.0990 1.1049 1.1067 1.0922
irintensity: 0.0249 0.0030 0.0849 0.0740 0.4658 0.5345 10.8411 1.2400 3.4701 1.0414 0.1555 0.2859 0.2411 0.0803 3.2260 0.6358 0.1939 0.0532 1.4873 2.3039 0.1704 4.6826 0.4784 0.0705 3.9138 1.2827 9.2260 3.8048 1.4225 12.9763 5.3828 0.1607 2.3319 3.6190 0.1454 0.9272 1.3136 0.3671 4.1665 2.2361 5.1319 5.1986 0.6930 2.2007 26.8348 1.7391 12.4722 21.6695 0.9935 9.5179 4.0185 3.4597 3.5602 0.9366 10.5963 2.3263 0.6616 3.6062 64.2117 25.1429 78.5103 15.3288 10.3929 14.1101 1.3376 5.8875 1.0223 10.1854 9.6303 15.3312 20.2009 12.0131 1.7991 3.8374 8.5936 3.0276 7.0194 9.6127 35.1997 10.7973 25.2602 8.0000 10.8809 9.4523 6.6795 99.6645 3.2874 0.3733 1.9841 7.1712 7.8131 9.4348 2.3569 4.5147 0.9206 1.0068 3.7531 3.6489 4.9373 16.1631 2.7463 1.7723 3.3247 20.3996 19.3192 15.1436 23.6650 5.2735 62.3072 14.1093 79.8698 5.2088 2.6607 25.0358 4.9008 7.6301 8.1743 5.9543 6.8910 4.9829 24.2721 4.4496 3.4833 8.1466 69.7541 55.2143 19.3030 37.0394 10.2804 20.8887 35.5009 31.6062 29.1224 139.6706 46.0636 14.0486 36.7094 23.3119 18.2912 88.3519 76.9976 51.9048 43.2999 33.1526 11.3483 27.1049 33.4088 72.5664 82.6990 59.7006 50.3231 30.7661 5.0498
temp: 298.150 k
press: 1.00000 atm
elementType: 8 8 7 6 6 6 6 6 6 6 6 6 6 6 6 6 6 6 6 6 6 6 6 6 1 1 1 1 1 1 1 1 1 1 1 1 1 1 1 1 1 1 1 1 1 1 1 1 1 1 1 1 1
symmnumber: 1
zpe: 1200585.0 jmol-1
zpe.correction: 0.457279 hartree
zpe.thermalcorrener: 0.479752 hartree
zpe.thermalcorrenthalpy: 0.480697 hartree
zpe.thermalcorrgfe: 0.405124 hartree
zpe.sumelectzpe: -1020.977039 hartree
zpe.sumelectthermal: -1020.954565 hartree
zpe.sumelectthermalent: -1020.953621 hartree
zpe.sumelectthermalfe: -1021.029193 hartree
dipole: -0.2205 -0.0728 -0.9431
dipole: 0.9713
quadrupole: -139.6127 -144.7318 -143.3928
quadrupole: 0.7373 -0.0341 -1.2877
quadrupole: 2.9664 -2.1527 -0.8138 0.7373 -0.0341 -1.2877
hfenergy: -1021.4343173 hartree
pointgroup: C01 [X(C21H29N1O2)]
dipole: -0.0847688 -0.0222643 -0.3719457 debye
polarizability: 271.2351495|14.9478309|253.1165587|-17.6259561|5.0289037|176.4870508 unknown
InChI: InChI=1S/C21H29NO2/c1-13(2)5-6-14-10-16-17-4-3-8-22(17)9-7-15-11-18-21(24-12-23-18)20(14)19(15)16/h11,13-14,16-17H,3-10,12H2,1-2H3
charge 0 multiplicity 1
53 atoms
O  1.8173 2.761525 -0.793142
O  0.187461 4.289107 0.076382
N  -3.272247 -1.837709 0.725011
C  -0.830803 -1.312591 0.159875
C  -2.151974 -1.995421 -0.265359
C  0.345199 -1.662159 -0.812857
C  1.334125 -0.453234 -0.775518
C  -0.808856 0.220533 0.212987
C  -2.767566 -1.551778 -1.620634
C  0.426815 0.683172 -0.338349
C  -4.572665 -1.829038 -0.010003
C  -4.214493 -2.089096 -1.499886
C  -1.770969 1.113277 0.751409
C  -3.153927 -0.836504 1.803298
C  2.535727 -0.645634 0.199397
C  -3.09173 0.657888 1.364799
C  0.657705 2.054437 -0.354435
C  -1.50091 2.519102 0.71935
C  3.589255 -1.636846 -0.342721
C  -0.299403 2.952558 0.160793
C  4.742952 -1.96718 0.643274
C  1.402476 4.18866 -0.771004
C  5.586457 -0.717673 0.994836
C  5.645047 -3.081268 0.060353
H  -0.579082 -1.708504 1.167408
H  -1.917839 -3.081675 -0.348339
H  0.835042 -2.613095 -0.53733
H  -0.052597 -1.779282 -1.837594
H  1.758376 -0.255456 -1.780427
H  -2.237976 -1.96706 -2.495909
H  -2.758625 -0.447718 -1.699541
H  -5.085337 -0.846036 0.091182
H  -5.264218 -2.598402 0.386282
H  -4.920982 -1.597007 -2.190222
H  -4.230151 -3.173959 -1.714906
H  -2.273353 -1.071291 2.428914
H  -4.0365 -0.96726 2.459302
H  3.005521 0.341118 0.373036
H  2.156031 -0.996377 1.181747
H  -3.311661 1.294698 2.246286
H  -3.920181 0.847231 0.649139
H  -2.219127 3.236816 1.127241
H  3.087667 -2.58613 -0.624767
H  4.025571 -1.225791 -1.278541
H  4.286597 -2.349271 1.582187
H  1.149811 4.506179 -1.802149
H  2.206073 4.789238 -0.319484
H  4.981616 0.064205 1.487834
H  6.028031 -0.278303 0.078935
H  6.416273 -0.980616 1.677337
H  6.122083 -2.743489 -0.880341
H  6.4508 -3.355871 0.766519
H  5.06266 -3.994525 -0.165156
