program: Gaussian 09
title: 000178016
version: EM64L-G09RevD.01
frameworkgroup: C1[X(C18H12O2)]
method: RPBEPBE
basis: SDD
operation: Freq
keyword: #pfreq=noraman
keyword: PBEPBE/SDD
title: #p freq=noraman PBEPBE/SDD
converged: YES YES NO NO
title: Mulliken charges:
elementType: O O C C C C C C C C C C C C C C C C C C H H H H H H H H H H H H
charge: -0.434989 -0.441369 -0.120507 -0.233375 0.269044 -0.367360 0.378986 0.098382 0.001515 0.477072 0.520328 -0.706455 -0.427253 0.490817 -0.475983 -0.476812 -0.477313 -0.490503 -0.464599 -0.234129 0.243761 0.225064 0.262955 0.248072 0.239724 0.239742 0.234062 0.247149 0.349224 0.357516 0.241737 0.225497
chargesum: 0.00000
title: Mulliken charges with hydrogens summed into heavy atoms:
elementType: O O C C C C C C C C C C C C C C C C C C
charge: -0.085764 -0.083853 -0.120507 0.010386 0.269044 -0.142296 0.378986 0.098382 0.001515 0.477072 0.520328 -0.443500 -0.179181 0.490817 -0.236258 -0.237069 -0.243251 -0.243355 -0.222862 -0.008632
polarizability: 3.06348281e+02 2.88505974e+01 2.47613408e+02 -1.02443912e+01 1.79406842e+00 8.91200966e+01
1716.lowfreq: -6.3655 -5.1010 -0.0010 -0.0007 -0.0004 2.9638 46.6803 81.2675 110.0556
frequency: 46.6768 81.2640 110.0519 125.0326 165.5712 202.4705 223.7628 250.7968 279.1590 290.8730 352.8111 361.1865 398.1835 414.7494 453.3624 462.8122 500.2520 509.9807 513.8931 536.1085 541.6929 553.7527 565.3029 616.5296 622.4744 659.6159 685.6027 706.2795 740.5880 761.3116 773.9496 778.5873 793.0840 826.0366 848.4712 856.1022 865.6623 890.7474 900.5124 927.5290 943.5998 960.1642 977.1708 981.5894 989.8401 1002.5066 1046.8345 1055.8498 1096.1262 1124.8284 1151.7414 1168.3412 1182.4412 1185.1991 1198.7231 1214.7107 1230.2270 1237.3207 1246.2553 1263.3662 1286.1952 1314.4290 1356.0608 1371.9561 1375.7829 1382.8395 1413.9165 1425.4164 1441.9534 1453.4791 1475.0075 1497.0104 1518.3059 1560.0293 1598.6323 1608.1713 1622.0921 1648.6091 2993.8847 3043.4654 3119.3336 3123.3098 3127.1925 3133.1185 3136.6111 3144.1408 3152.8870 3156.5434 3500.3662 3545.1893
redmass: 6.2495 4.8663 3.1630 1.2664 4.6058 7.4631 4.9624 4.0761 4.4095 4.6054 5.1441 5.9301 6.6500 4.3616 6.0469 4.1423 4.4024 4.1823 3.6668 2.0781 2.4797 3.0835 4.6969 4.6596 4.3332 5.1268 5.4166 3.6162 4.6161 2.2029 2.8630 2.2593 2.8651 1.9526 3.5466 3.9238 1.7038 4.7193 1.5455 1.9441 2.7615 1.4641 4.0616 1.4658 1.4074 5.9973 3.5263 3.0315 2.0822 1.8966 1.4616 1.4036 1.2659 1.2090 1.2776 1.4986 2.0089 1.4033 1.5820 1.8615 1.8036 2.6740 1.5647 1.9543 1.6327 3.2001 2.1201 3.6075 4.6194 5.1922 5.7700 4.2380 5.6441 5.6426 7.5556 7.3124 8.4568 9.1265 1.0860 1.0857 1.0863 1.0860 1.0880 1.0920 1.0918 1.0975 1.0956 1.0987 1.0647 1.0659
irintensity: 3.9475 4.7030 35.3279 194.4330 3.4966 24.5017 3.6968 1.2589 10.1786 1.4374 1.1394 1.2718 0.8847 0.5850 6.6699 1.8773 1.9043 2.8301 0.5182 2.3544 1.9007 3.8987 3.4632 0.5098 9.4619 4.4573 2.4100 11.0363 24.9268 13.0739 5.3534 2.9093 38.4610 4.0115 24.5778 1.4928 70.0881 19.6326 57.3030 10.8920 6.8361 2.3162 16.2727 6.1392 1.4070 73.4759 37.1586 51.3146 5.6872 7.6152 9.4510 24.9061 2.6550 11.8996 7.0584 14.8941 1.9122 15.9761 8.4126 0.8131 2.8521 4.9990 31.6552 13.6467 38.5113 6.8995 2.3472 2.8855 2.2883 0.5522 7.2467 1.3052 0.7966 4.2487 6.7048 0.7410 1.9664 0.1304 43.7022 32.8125 1.5095 0.3036 5.9522 8.4432 12.3582 35.3861 29.5523 39.2176 17.3531 5.0093
temp: 298.150 k
press: 1.00000 atm
elementType: 8 8 6 6 6 6 6 6 6 6 6 6 6 6 6 6 6 6 6 6 1 1 1 1 1 1 1 1 1 1 1 1
symmnumber: 1
zpe: 645837.5 jmol-1
zpe.correction: 0.245987 hartree
zpe.thermalcorrener: 0.260286 hartree
zpe.thermalcorrenthalpy: 0.261231 hartree
zpe.thermalcorrgfe: 0.205285 hartree
zpe.sumelectzpe: -842.251449 hartree
zpe.sumelectthermal: -842.237149 hartree
zpe.sumelectthermalent: -842.236205 hartree
zpe.sumelectthermalfe: -842.292150 hartree
dipole: -0.2503 1.0620 -0.9451
dipole: 1.4435
quadrupole: -95.9795 -107.0822 -118.8551
quadrupole: 3.8373 -4.7859 -0.6860
quadrupole: 11.3261 0.2234 -11.5495 3.8373 -4.7859 -0.6860
hfenergy: -842.4974351 hartree
pointgroup: C01 [X(C18H12O2)]
dipole: 0.0797632 -0.4239163 -0.369411 debye
polarizability: 308.9991129|25.7107721|244.7538183|11.9025383|-2.7523809|89.3288546 unknown
InChI: InChI=1S/C18H12O2/c19-17-12-7-6-10-5-4-9-2-1-3-11-8-13(18(17)20)16(12)15(10)14(9)11/h1-8,17-20H
charge 0 multiplicity 1
32 atoms
O  -3.298496 2.546076 0.358534
O  -4.138673 0.048561 0.864261
C  -0.995506 -0.089611 -0.243093
C  -2.688794 1.575128 -0.549262
C  -1.193137 1.328916 -0.332251
C  -3.362948 0.124537 -0.3949
C  -2.190757 -0.835417 -0.297694
C  0.279579 -0.681147 -0.10166
C  1.418182 0.177212 -0.030625
C  0.368727 -2.112248 -0.02551
C  1.239148 1.613074 -0.102552
C  -0.099821 2.17408 -0.259634
C  -2.113442 -2.24288 -0.219401
C  2.722609 -0.412758 0.116521
C  -0.843164 -2.866658 -0.091364
C  1.694221 -2.67925 0.11885
C  2.814555 -1.861034 0.185522
C  2.402026 2.427492 -0.023047
C  3.85192 0.446902 0.19026
C  3.683798 1.848053 0.12042
H  -2.885433 1.987819 -1.554046
H  -4.031266 -0.08926 -1.252308
H  -0.21367 3.262697 -0.315785
H  -3.020297 -2.856392 -0.243142
H  -0.788267 -3.960237 -0.03245
H  1.804086 -3.768523 0.177797
H  3.810067 -2.30767 0.296929
H  2.299666 3.517721 -0.073578
H  -3.311719 2.120487 1.257885
H  -5.008992 0.502774 0.719678
H  4.854496 0.018209 0.303365
H  4.562999 2.499045 0.179579
