program: Gaussian 09
title: 000178004
version: EM64L-G09RevD.01
frameworkgroup: C1[X(C12H4Cl6O)]
method: RPBEPBE
basis: SDD
operation: Freq
keyword: #p
keyword: freq=noraman
keyword: PBEPBE/SDD
title: #p freq=noraman PBEPBE/SDD
converged: YES YES NO NO
title: Mulliken charges:
elementType: Cl Cl Cl Cl Cl Cl O C C C C C C C C C C C C H H H H
charge: 0.028877 0.024487 -0.001622 0.008534 0.042062 0.010936 -0.378859 0.453211 0.418870 -0.338186 -0.386503 -0.275135 -0.367224 -0.221887 -0.294992 0.492167 -0.051640 -0.222923 -0.117092 0.279762 0.261870 0.266807 0.368480
chargesum: 0.00000
title: Mulliken charges with hydrogens summed into heavy atoms:
elementType: Cl Cl Cl Cl Cl Cl O C C C C C C C C C C C C
charge: 0.028877 0.024487 -0.001622 0.008534 0.042062 0.010936 -0.010380 0.453211 0.418870 -0.338186 -0.106741 -0.275135 -0.105354 -0.221887 -0.294992 0.492167 -0.051640 0.043884 -0.117092
polarizability: 2.81481334e+02 4.90561816e+00 1.75045945e+02 1.23997121e+01 -9.04331512e+00 1.32310522e+02
1716.lowfreq: -3.1780 -2.3314 0.0003 0.0005 0.0016 4.5290 18.4936 34.5063 40.3336
frequency: 18.4844 34.5018 40.3324 77.3587 85.9476 103.2135 124.7865 146.9862 187.7198 193.7249 198.3977 206.5635 232.2405 238.6896 266.6513 281.4868 316.9902 327.4660 331.5766 354.6022 377.0512 446.4799 450.5177 471.2673 501.2224 505.0165 516.9269 531.6011 583.3483 621.8988 649.9327 668.2692 725.9593 735.7181 741.5624 767.7366 805.7168 822.3689 884.9469 910.7645 951.8758 1024.9547 1068.7759 1120.3605 1152.6472 1155.9628 1166.9222 1262.6565 1315.6369 1331.2719 1349.6779 1353.4667 1378.1348 1423.6202 1465.3063 1544.7560 1553.7876 1583.0366 1599.8169 3157.3554 3170.5758 3181.0191 3490.3168
redmass: 15.9694 18.6472 15.2881 25.6411 23.5098 12.2583 8.6281 22.0572 10.6696 26.7980 25.8114 29.1453 12.5886 8.5793 7.2736 8.6766 17.1270 13.1637 13.6966 8.8633 13.0071 1.1390 5.6166 11.0237 5.5268 8.4214 5.8303 7.3567 8.3473 5.3603 8.9831 10.2280 7.4029 7.0422 7.3246 6.9944 8.9290 1.4335 1.4410 9.2229 1.3534 9.8869 6.6321 3.1322 1.6339 1.5406 2.1987 1.5069 4.8305 4.4931 4.7431 6.2710 8.8734 3.2528 6.3804 7.9685 6.2741 7.7767 9.4878 1.0894 1.0929 1.0970 1.0648
irintensity: 0.2784 0.0430 0.1257 0.0780 0.0460 0.0167 0.5832 0.1245 0.4840 0.0909 0.0901 0.0652 0.9580 1.3689 0.3391 7.3340 0.1563 2.1397 1.0274 2.0998 5.6615 136.5043 11.8074 7.8168 3.0558 23.9863 2.1537 4.3126 25.3031 13.8603 2.2768 15.8430 18.2088 0.2287 29.4735 46.1852 74.7036 22.2431 9.2259 16.2410 0.1360 2.0750 42.9778 16.1498 221.9592 64.5202 1.2153 60.2765 37.8455 51.6842 47.9511 29.2368 8.2100 242.5754 19.4861 4.1614 12.0618 19.9510 6.6178 2.3856 0.1020 0.7795 82.9339
temp: 298.150 k
press: 1.00000 atm
elementType: 17 17 17 17 17 17 8 6 6 6 6 6 6 6 6 6 6 6 6 1 1 1 1
symmnumber: 1
zpe: 324714.1 jmol-1
zpe.correction: 0.123677 hartree
zpe.thermalcorrener: 0.141917 hartree
zpe.thermalcorrenthalpy: 0.142861 hartree
zpe.thermalcorrgfe: 0.074475 hartree
zpe.sumelectzpe: -3293.911437 hartree
zpe.sumelectthermal: -3293.893197 hartree
zpe.sumelectthermalent: -3293.892253 hartree
zpe.sumelectthermalfe: -3293.960639 hartree
dipole: 1.0971 0.5043 -2.1075
dipole: 2.4289
quadrupole: -153.1607 -150.4312 -146.9394
quadrupole: -10.5685 2.0723 -4.0406
quadrupole: -2.9836 -0.2541 3.2377 -10.5685 2.0723 -4.0406
hfenergy: -3294.0351138 hartree
pointgroup: C01 [X(C12H4Cl6O1)]
dipole: 0.4013191 0.1291813 0.8575635 debye
dipolederiv: -0.2146289 0.2349326 -0.0195687 0.2641331 -0.5073521 0.0518454 -0.0252595 0.053567 -0.0100917 -0.2001173 -0.0105106 0.2192469 -0.0170381 -0.0104886 0.0283614 0.2499043 0.0279833 -0.5277475 -0.3662364 -0.2685943 0.0623139 -0.2939072 -0.457932 0.0892991 0.0807842 0.096882 -0.0280022 -0.2556334 0.2498773 -0.0377412 0.363296 -0.5999972 0.0909266 -0.052381 0.0935756 -0.0360175 -0.3131368 0.0195711 -0.2889891 0.0321391 0.0017107 0.033119 -0.3771248 0.0283005 -0.3928177 -0.8253189 -0.019297 0.145775 -0.0074555 -0.0226147 0.0075421 0.1353469 0.0054336 -0.0845184 -1.5284209 -0.028035 0.0570821 -0.0280806 -0.1217764 -0.0499173 0.0888512 -0.0439006 -0.3570121 0.1679819 0.0512571 0.0367616 0.1445736 -0.2159529 0.0288077 0.0055024 0.022539 -0.0484343 0.3416487 0.049835 0.0388619 0.0368003 -0.0406609 0.0095756 0.1048814 0.0220684 -0.1593946 0.215521 -0.2277019 -0.000508 -0.4740434 0.6859954 -0.0469308 0.0272424 -0.0985914 0.0000514 -0.0884624 -0.0260258 -0.0051093 0.0399059 -0.0901781 0.0090706 0.0330767 0.0297528 -0.0657493 0.0966072 0.0105779 -0.4076928 0.0216384 -0.0110653 -0.0506834 -0.4178556 -0.0232183 0.6867407 -0.0742557 -0.004743 -0.0155605 0.0148048 -0.1129402 -0.0008465 -0.0808355 -0.0105947 0.0615806 0.0937487 0.320661 -0.0613949 0.7872023 0.5010077 -0.1510564 -0.1420269 -0.1262145 -0.0417258 0.1155758 -0.3132641 0.0430222 -0.7530689 0.9148989 -0.1575005 0.0969683 -0.1726284 -0.063698 1.2470857 0.0252734 -0.066445 0.0180743 -0.2842854 0.0785618 -0.0939329 0.0740331 0.1182403 0.1100285 -0.0442738 0.6050344 -0.0472362 -0.0165065 -0.0392812 0.6778004 -0.0424771 0.4263537 -0.323804 -0.0095114 0.0365102 -0.0283361 -0.0893794 -0.0046543 -0.038749 -0.0113343 -0.0131445 1.1320882 0.030847 -0.3264774 0.0124087 -0.0454822 -0.0089443 -0.2424289 -0.0044801 0.0278173 0.0955018 -0.0432782 0.0203167 -0.0697416 0.0336106 0.014471 0.0169226 0.0224912 0.1324407 0.0368888 0.0109765 -0.0717822 0.0095819 0.1347691 0.0124922 -0.0861231 0.0042672 0.0107909 0.0419292 -0.0050386 0.0416716 -0.00013 0.1612416 0.0147816 0.0416351 0.0156204 0.0035107 0.4954091 -0.0035352 -0.0053274 -0.0255208 0.193378 0.0409606 -0.0021989 0.0369253 0.3608272 unknown
polarizability: 281.979391|-8.5630912|162.6344059|-4.7312794|-21.7230774|144.2240037 unknown
InChI: InChI=1S/C12H4Cl6O/c13-6-2-1-4(8(15)10(6)17)5-3-7(14)12(19)11(18)9(5)16/h1-3,19H
charge 0 multiplicity 1
23 atoms
Cl 0.486489 2.67254 -0.237261
Cl -1.029494 0.126759 -2.443617
Cl 3.734938 2.518686 -0.475932
Cl 3.551649 -2.917361 0.546483
Cl -4.235654 0.127892 -2.099185
Cl -5.521572 -0.140763 0.874356
O  4.825339 -0.283857 -0.04797
C  0.584679 -0.084804 0.212907
C  -0.906408 -0.080484 0.334355
C  1.33425 1.089628 -0.048724
C  1.291055 -1.300078 0.398985
C  -1.760865 0.015695 -0.793878
C  -1.502379 -0.212229 1.613219
C  2.73774 1.033295 -0.139785
C  2.690488 -1.348872 0.310878
C  3.447849 -0.184997 0.034684
C  -3.170011 0.001896 -0.655018
C  -2.901494 -0.231804 1.771978
C  -3.728988 -0.120412 0.638435
H  0.732335 -2.218554 0.598658
H  -0.855429 -0.286238 2.492531
H  -3.352416 -0.326497 2.763174
H  5.226298 0.604061 -0.251471
