program: Gaussian 09
title: 000178033
version: EM64L-G09RevD.01
frameworkgroup: C1[X(C11H26NO2PS)]
method: RPBEPBE
basis: SDD
operation: Freq
keyword: #p
keyword: freq=noraman
keyword: PBEPBE/SDD
title: #p freq=noraman PBEPBE/SDD
converged: YES YES NO NO
title: Mulliken charges:
elementType: S P O O N C C C C C C C C C C C H H H H H H H H H H H H H H H H H H H H H H H H H H
charge: -0.059823 0.954413 -0.509166 -0.620670 -0.101946 -0.282608 -0.041875 -0.713526 -0.330958 -0.355075 -0.258911 -0.695410 -0.701455 -0.670850 -0.667235 -0.868804 0.215434 0.215206 0.214670 0.284878 0.308703 0.187893 0.209127 0.187695 0.260918 0.207987 0.219070 0.207815 0.212943 0.223203 0.206545 0.195185 0.269554 0.207920 0.227485 0.206487 0.201895 0.224653 0.208701 0.271889 0.283610 0.264431
chargesum: 0.00000
title: Mulliken charges with hydrogens summed into heavy atoms:
elementType: S P O O N C C C C C C C C C C C
charge: -0.059823 0.954413 -0.509166 -0.620670 -0.101946 0.148032 0.172795 -0.119944 0.066062 0.093539 0.168146 -0.051448 -0.030171 -0.028957 -0.031988 -0.048875
polarizability: 2.22360089e+02 3.62270892e+00 1.69253912e+02 -5.73280526e+00 3.42497916e+00 1.62758382e+02
1716.lowfreq: -11.4063 -3.0309 -0.0015 -0.0010 0.0014 5.8671 15.7044 22.1363 30.0480
frequency: 15.0509 21.5161 29.8209 30.9473 53.1824 64.6192 69.4737 86.0305 95.1364 127.9216 143.8194 148.4850 157.2508 177.6291 189.5086 199.1102 214.5284 223.8653 235.7700 241.6446 256.6211 283.7769 289.6546 297.0207 324.8838 330.5595 374.6879 389.1232 399.8626 405.7702 445.3466 459.3282 476.0501 636.5549 652.7526 718.7972 734.5445 756.7334 795.0566 799.1732 813.8935 896.8848 909.8388 914.6774 928.8588 941.4789 946.2454 965.7302 976.7119 986.7907 1009.9607 1023.7842 1049.4422 1076.1593 1080.5367 1084.7848 1101.4388 1133.9450 1144.0836 1156.0411 1185.5052 1207.9390 1222.9347 1244.5675 1262.8330 1288.6550 1289.8784 1290.8453 1300.0432 1337.4590 1343.8221 1353.9014 1354.6498 1368.4355 1379.5355 1379.7149 1384.7335 1389.2834 1402.0182 1424.0432 1429.9497 1432.0635 1459.7015 1460.1906 1464.7215 1469.2838 1472.6938 1473.8695 1478.2309 1480.6274 1482.7832 1489.6941 1490.0486 1492.4636 2853.5781 2867.9358 2899.3969 2969.3564 2970.5244 2973.4563 2980.1560 2980.9637 2991.9634 3024.1351 3028.1931 3031.9368 3033.8020 3048.3712 3056.5709 3059.6088 3069.0546 3072.1943 3073.8282 3077.5784 3084.5024 3089.0528 3090.2025 3116.9502 3146.8010 3155.0791
redmass: 3.8224 3.5641 3.0637 4.1765 3.5688 3.1157 2.7730 2.0838 4.0565 2.8871 1.0611 2.7333 2.6645 2.1066 1.3272 1.7741 1.7044 1.8692 2.7872 1.3850 1.6954 3.5944 2.1427 4.9893 3.1692 3.2333 4.3444 2.9801 5.4720 1.9090 2.7752 3.7990 2.6944 6.3256 5.6840 6.4877 1.6431 1.6414 1.1284 1.2140 2.6366 1.5800 1.9359 1.2581 1.7924 1.5646 1.4188 1.6445 3.2678 2.2505 1.6039 3.3306 3.2037 2.4905 2.2324 2.0471 1.7007 2.2605 1.4587 1.7985 1.7500 2.2273 1.5980 1.1858 1.2154 1.3370 1.2349 1.1280 1.2490 1.1643 1.4586 1.2967 1.3219 1.3514 1.2099 1.2672 1.2327 1.2752 1.2036 1.0871 1.0466 1.0448 1.0624 1.0712 1.0534 1.0464 1.0527 1.0606 1.0581 1.0451 1.0505 1.0725 1.0556 1.0817 1.0719 1.0710 1.0700 1.0376 1.0464 1.0530 1.0356 1.0357 1.0801 1.0311 1.0893 1.0882 1.0587 1.0898 1.1026 1.0989 1.0995 1.0984 1.0981 1.0991 1.0997 1.1003 1.1002 1.1078 1.1022 1.1026
irintensity: 0.1996 0.5137 0.1571 0.6038 0.6400 0.2841 0.8554 0.2568 2.4959 1.8462 0.4000 9.6991 0.7334 1.8086 1.3797 4.4193 1.1231 0.0074 5.7380 1.5857 0.4797 7.7837 1.9614 3.3220 7.7602 2.9071 17.7845 6.8961 68.6733 5.1539 10.2847 30.1479 4.8268 136.7291 19.6421 48.0626 11.9479 12.4786 4.4995 3.7528 5.5012 25.6815 1.9864 0.9720 36.9953 76.8559 104.4883 2.0856 154.3317 3.6845 14.5444 71.5578 4.0288 14.4993 37.8788 3.6371 36.8431 1.5027 11.3171 1.4480 1.9214 46.9551 8.2428 4.8493 21.8147 0.7644 10.1374 8.4757 19.9773 20.0939 0.8120 2.3556 3.1138 2.4542 17.8571 1.5455 23.2683 22.8323 13.9787 10.1590 10.0175 9.7074 0.7893 4.8569 6.8712 2.5699 5.3222 7.9785 10.8905 6.8002 11.5872 5.7556 41.5025 9.7296 74.9983 119.5552 85.0458 17.7205 17.0105 40.4104 34.6706 31.0640 20.8669 1.2281 0.4995 14.6503 9.1137 24.3119 14.3795 13.5505 93.5507 31.8396 78.5273 42.1437 15.7113 36.3840 45.1357 1.5061 1.8910 1.5749
temp: 298.150 k
press: 1.00000 atm
elementType: 16 15 8 8 7 6 6 6 6 6 6 6 6 6 6 6 1 1 1 1 1 1 1 1 1 1 1 1 1 1 1 1 1 1 1 1 1 1 1 1 1 1
symmnumber: 1
zpe: 946396.9 jmol-1
zpe.correction: 0.360464 hartree
zpe.thermalcorrener: 0.383572 hartree
zpe.thermalcorrenthalpy: 0.384516 hartree
zpe.thermalcorrgfe: 0.305004 hartree
zpe.sumelectzpe: -1377.889907 hartree
zpe.sumelectthermal: -1377.866799 hartree
zpe.sumelectthermalent: -1377.865854 hartree
zpe.sumelectthermalfe: -1377.945366 hartree
dipole: -0.0838 -1.2668 0.0132
dipole: 1.2696
quadrupole: -106.2511 -114.8448 -116.8833
quadrupole: -1.5833 2.4847 -6.3542
quadrupole: 6.4086 -2.1851 -4.2235 -1.5833 2.4847 -6.3542
hfenergy: -1378.2503702 hartree
pointgroup: C01 [X(C11H26N1O2P1S1)]
dipole: -0.1146724 -0.2764177 -0.3999273 debye
polarizability: 222.5292626|-3.1905917|161.0714786|-4.5438722|2.0886682|170.7716422 unknown
InChI: InChI=1S/C6H14NS.C5H12O2P/c1-3-7(4-2)5-6-8;1-5(2)4-7-8(3)6/h3-6H2,1-2H3;5H,4H2,1-3H3
charge 0 multiplicity 1
42 atoms
S  -0.363633 0.238577 -2.301763
P  -1.511516 -0.845999 -0.609885
O  -3.115666 -0.180854 -0.660079
O  -0.70751 -0.762641 0.777146
N  3.288159 -0.114396 -0.277958
C  2.209809 -0.460142 -1.22952
C  -3.925216 1.669451 0.83571
C  1.167551 0.672944 -1.245554
C  4.651075 -0.49088 -0.730151
C  2.979399 -0.525184 1.12152
C  -3.38474 1.278225 -0.552447
C  -4.570055 3.075224 0.738245
C  -2.836864 1.629381 1.930881
C  5.178052 0.407073 -1.866221
C  3.622051 0.399575 2.172634
C  -1.928344 -2.554272 -1.202073
H  2.630064 -0.587071 -2.243215
H  1.706863 -1.42011 -0.963675
H  -4.717739 0.936939 1.090228
H  1.575799 1.597005 -1.685785
H  0.80023 0.878792 -0.226588
H  4.696732 -1.564538 -1.04543
H  5.328073 -0.392056 0.137946
H  3.298866 -1.582043 1.302636
H  1.880936 -0.508419 1.247702
H  -2.468203 1.849858 -0.807363
H  -4.145266 1.466142 -1.331598
H  -3.823066 3.834339 0.434863
H  -5.39857 3.097682 0.00547
H  -4.975032 3.381275 1.719482
H  -3.280119 1.832396 2.923171
H  -2.065765 2.402221 1.742121
H  -2.323541 0.652774 1.973006
H  4.54285 0.344469 -2.769007
H  5.199363 1.460825 -1.53774
H  6.201412 0.103859 -2.156873
H  4.725466 0.405887 2.101065
H  3.267075 1.435739 2.034305
H  3.353501 0.066806 3.192742
H  -2.409755 -2.487109 -2.188402
H  -2.614166 -3.019679 -0.47688
H  -0.998264 -3.137565 -1.274068
