program: Gaussian 09
title: 000177988
version: EM64L-G09RevD.01
frameworkgroup: C1[X(C16H22ClNO3S)]
method: RPBEPBE
basis: SDD
operation: Freq
keyword: #p
keyword: freq=noraman
keyword: PBEPBE/SDD
title: #p freq=noraman PBEPBE/SDD
converged: YES YES NO NO
title: Mulliken charges:
elementType: Cl S O O O N C C C C C C C C C C C C C C C C H H H H H H H H H H H H H H H H H H H H H H
charge: -0.020845 0.171958 -0.259974 -0.368947 -0.212321 -0.328775 -0.151720 -0.508518 -0.530430 0.011175 -0.542127 -0.539279 0.051015 0.157308 -0.081896 -0.840047 0.376350 -0.483226 -0.687549 -0.336795 -0.010447 -0.421382 0.261638 0.237728 0.234416 0.251429 0.210843 0.255534 0.251860 0.245503 0.251823 0.263386 0.258705 0.254358 0.273643 0.230123 0.393381 0.252374 0.224625 0.219917 0.225941 0.223571 0.265977 0.269696
chargesum: 0.00000
title: Mulliken charges with hydrogens summed into heavy atoms:
elementType: Cl S O O O N C C C C C C C C C C C C C C C C
charge: -0.020845 0.171958 -0.259974 -0.368947 -0.212321 0.064606 -0.151720 -0.009151 -0.044584 0.222018 -0.034733 -0.041953 0.051015 0.157308 -0.081896 -0.063598 0.376350 0.020540 0.009367 0.112718 0.255531 -0.151687
polarizability: 3.39797929e+02 -5.70607069e-01 2.05271400e+02 -5.26234824e+00 5.93048271e+00 1.61709905e+02
1716.lowfreq: -18.6375 -11.0744 -5.3542 -0.0022 -0.0016 -0.0012 1.9140 17.5646 27.2007
frequency: -18.5162 16.7566 27.1013 31.0698 38.6458 59.6290 66.2901 72.9651 78.4328 97.8082 117.5884 122.9845 127.6691 149.2658 158.6216 176.4704 194.4514 200.9744 217.5051 247.7619 250.7579 258.1056 268.7485 306.6745 325.1466 347.1691 363.8268 382.8716 397.4160 436.1538 444.9784 461.0681 475.3858 508.4771 531.4857 576.3243 594.4433 619.0143 632.1566 653.0186 660.2730 730.4708 743.8771 756.1411 782.8674 784.1637 826.2874 859.1253 864.8250 897.0368 903.3332 909.6756 925.6126 935.9822 946.7227 955.4260 965.0387 978.6830 986.2127 1011.3809 1018.2507 1041.8292 1045.0117 1059.7140 1075.4683 1076.4352 1091.2197 1106.7113 1120.4174 1129.8888 1130.4315 1154.4204 1164.5079 1175.5446 1218.3162 1240.7562 1253.4150 1262.1258 1263.2355 1274.5660 1279.7802 1294.2830 1314.1211 1316.7884 1336.3860 1343.0687 1355.5949 1361.3523 1379.4596 1419.2077 1433.8391 1434.7111 1442.6502 1449.3474 1451.2737 1455.8027 1465.9312 1471.6918 1474.1369 1482.8729 1505.8872 1533.8397 1558.8055 1647.0522 2109.0588 2950.6884 2965.0452 2970.6270 2974.6022 2993.1735 3009.7643 3031.0429 3043.6452 3059.3858 3063.1297 3087.1318 3087.8100 3098.8312 3100.5277 3117.5100 3127.7875 3131.0781 3155.0581 3183.6250 3188.2663 3209.5238
redmass: 3.4390 7.8720 4.2622 5.6292 4.0526 1.7646 3.2462 3.5610 3.3642 3.2291 3.0511 3.3734 2.5903 4.3076 5.3198 5.5928 1.4634 2.1297 4.0938 3.1538 4.4429 3.2226 3.5914 2.4542 4.1326 4.4276 4.1755 5.1796 2.7448 4.4940 3.4989 4.1275 4.3249 4.9635 3.8815 3.8542 3.7602 3.8588 4.0684 6.0699 3.8796 4.5013 2.3755 2.7813 1.0652 1.5495 2.1340 3.4007 1.6350 3.3302 4.2807 2.8577 1.2177 3.2475 1.3532 1.5915 1.3160 1.7894 1.3485 3.6270 3.5627 1.2186 2.7620 1.7832 2.0188 1.6192 1.7854 2.1599 1.3525 2.2760 1.2871 1.3698 2.2025 1.1016 1.4841 1.1557 1.5613 1.5419 1.4868 1.2126 2.5473 1.8450 1.3748 1.4397 1.2791 2.1098 1.6470 1.9407 1.3161 2.7118 1.0823 1.0860 1.0797 1.3726 1.1311 1.2309 1.0768 1.0957 1.0654 1.0613 4.7801 3.5368 8.4084 6.5873 1.1019 1.0789 1.0653 1.0686 1.0570 1.0343 1.0284 1.0608 1.1067 1.0942 1.0948 1.0531 1.1007 1.0614 1.0987 1.1031 1.1033 1.1047 1.0929 1.0961 1.1159 1.1145
irintensity: 3.3443 0.0852 2.4285 2.5188 0.3390 0.5095 0.9478 1.2269 0.8479 2.3694 1.4203 3.0304 7.3642 0.4412 0.9163 2.7238 6.8424 4.0608 2.9061 63.2595 3.2234 7.2651 17.4844 13.2421 0.9198 17.5393 114.1400 5.4479 106.9109 25.8306 5.4131 7.6046 4.2272 7.5949 3.6305 0.8237 16.9104 109.4708 33.6376 22.8269 82.2348 1.2144 22.1425 118.7513 0.2387 30.1096 172.5563 4.4831 3.6998 8.2444 10.1429 9.0609 3.3125 124.1309 142.5608 2.6175 16.8053 32.9790 13.3622 13.7645 8.7371 23.4728 6.2276 18.1350 8.7685 4.4586 6.9330 43.3772 66.1477 12.0566 11.9191 0.2341 20.6701 6.2073 11.9982 19.7472 3.1081 4.1140 1.7952 5.0016 74.8116 19.2353 2.0679 6.6244 9.5229 45.3742 21.3409 40.6268 25.6062 232.4978 19.9903 0.3322 15.4980 97.0389 5.9691 4.2760 8.5482 25.9457 23.1034 2.9988 328.4862 217.4130 323.4118 100.2621 181.6924 9.3158 6.8843 19.5220 34.9592 32.2741 33.3480 13.7304 26.9278 12.7356 15.2578 14.1814 24.8290 11.3645 19.4396 6.4334 13.0023 16.7996 3.6478 9.1893 3.6386 14.2550
temp: 298.150 k
press: 1.00000 atm
elementType: 17 16 8 8 8 7 6 6 6 6 6 6 6 6 6 6 6 6 6 6 6 6 1 1 1 1 1 1 1 1 1 1 1 1 1 1 1 1 1 1 1 1 1 1
symmnumber: 1
zpe: 910512.5 jmol-1
zpe.correction: 0.346796 hartree
zpe.thermalcorrener: 0.370859 hartree
zpe.thermalcorrenthalpy: 0.371803 hartree
zpe.thermalcorrgfe: 0.290134 hartree
zpe.sumelectzpe: -1759.662972 hartree
zpe.sumelectthermal: -1759.638909 hartree
zpe.sumelectthermalent: -1759.637965 hartree
zpe.sumelectthermalfe: -1759.719634 hartree
dipole: -0.2820 -3.9982 1.1784
dipole: 4.1778
quadrupole: -148.6113 -154.3719 -140.2259
quadrupole: -7.0226 0.6164 -0.6138
quadrupole: -0.8749 -6.6355 7.5104 -7.0226 0.6164 -0.6138
hfenergy: -1760.0097677 hartree
pointgroup: C01 [X(C16H22Cl1N1O3S1)]
dipole: 0.0993242 1.6406601 0.0010077 debye
polarizability: 339.5948345|2.1747542|198.5860865|7.7238991|-16.7361536|168.5983131 unknown
InChI: InChI=1S/C16H22ClNO3S/c1-3-12(18-21-8-4-7-17)15-13(19)9-11(10-14(15)20)16(22-2)5-6-16/h4,7,11,18H,3,5-6,8-10H2,1-2H3
charge 0 multiplicity 1
44 atoms
Cl 8.373455 0.994029 -0.026529
S  -5.227317 0.113642 -1.311557
O  -0.842475 -2.785593 0.975269
O  0.270774 1.537875 -0.898714
O  3.520565 -0.1247 -0.280816
N  2.088452 0.09852 -0.267328
C  -4.411139 0.551225 0.319939
C  -5.289134 0.31058 1.557332
C  -4.993706 1.74496 1.089801
C  -2.914583 0.23767 0.442595
C  -2.624289 -1.27401 0.358388
C  -2.054168 0.9496 -0.6197
C  -1.140457 -1.635008 0.509699
C  -0.58236 0.619188 -0.475497
C  -0.139162 -0.634484 0.081226
C  -5.068671 1.733423 -2.269046
C  1.299191 -0.88991 0.185208
C  1.928235 -2.158823 0.715499
C  2.070564 -3.232583 -0.400845
C  4.205674 1.202796 -0.383952
C  5.660734 0.908428 -0.619567
C  6.61213 1.292452 0.258628
H  -6.300751 -0.07125 1.401066
H  -4.792769 -0.056018 2.462211
H  -4.298835 2.352368 1.679998
H  -5.818987 2.306164 0.642487
H  -2.593894 0.597786 1.445084
H  -3.179214 -1.843384 1.124548
H  -2.971091 -1.646323 -0.629041
H  -2.388903 0.61633 -1.6246
H  -2.163391 2.047927 -0.583356
H  -4.035017 1.903233 -2.604289
H  -5.405595 2.571381 -1.638958
H  -5.734805 1.636562 -3.141124
H  1.286043 -2.568747 1.508146
H  2.926637 -1.914172 1.11703
H  1.49905 0.995497 -0.689742
H  1.076906 -3.532146 -0.77312
H  2.563641 -4.129698 0.012913
H  2.68034 -2.859191 -1.242401
H  3.769756 1.753413 -1.241866
H  4.035799 1.778366 0.54557
H  5.922745 0.374704 -1.53979
H  6.429621 1.81372 1.2018
