program: Gaussian 09
title: 000177937
version: EM64L-G09RevD.01
frameworkgroup: C1[X(C10H14ClN)]
method: RPBEPBE
basis: SDD
operation: Freq
keyword: #p
keyword: freq=noraman
keyword: PBEPBE/SDD
title: #p freq=noraman PBEPBE/SDD
converged: YES YES NO NO
title: Mulliken charges:
elementType: Cl N C C C C C C C C C C H H H H H H H H H H H H H H
charge: -0.114361 -0.424610 0.463149 0.452034 -0.112482 -0.508904 -0.581497 -0.430285 -0.420799 -0.226053 -0.689012 -0.667246 0.239940 0.202020 0.228810 0.226310 0.242989 0.239762 0.229596 0.210208 0.216446 0.255628 0.215468 0.227331 0.229936 0.295624
chargesum: 0.00000
title: Mulliken charges with hydrogens summed into heavy atoms:
elementType: Cl N C C C C C C C C C C
charge: -0.114361 -0.128986 0.463149 0.452034 -0.112482 -0.066944 -0.126377 -0.187297 -0.181037 0.003543 -0.006730 0.005489
polarizability: 1.46446856e+02 -7.92192438e+00 1.66119762e+02 -6.25207175e-01 -1.61249203e+00 8.81614806e+01
1716.lowfreq: -11.4972 -9.1252 -0.0010 -0.0006 0.0017 8.7492 47.4058 58.9918 75.2456
frequency: 47.3226 58.9802 75.1881 93.2901 119.4430 148.7308 196.6203 217.3496 223.6703 285.7816 311.3503 334.6594 362.5609 422.4476 461.3670 511.9164 520.8444 565.6914 632.1140 643.3230 775.2122 784.7373 788.9250 814.3377 831.9289 851.6807 914.3132 946.9050 966.3306 984.0431 1009.6728 1032.3628 1058.0610 1059.8336 1083.5394 1100.8601 1176.0649 1190.4663 1223.1925 1235.9155 1246.5864 1251.3009 1294.1226 1310.7228 1316.4044 1377.0135 1385.6968 1394.4025 1429.6753 1462.6404 1469.8728 1471.4359 1477.9997 1480.6708 1491.6117 1498.0571 1578.7595 1594.8278 2979.8124 2981.1773 2983.2657 2997.0360 3038.8512 3056.3466 3075.3983 3079.5082 3086.0314 3101.1140 3120.6314 3130.8594 3155.4697 3366.6933
redmass: 4.0300 3.8884 3.6663 2.5738 5.1726 3.3212 1.3550 1.2454 1.9743 3.1661 2.8477 3.4214 2.9821 5.2927 2.8354 4.0433 4.2145 4.1034 3.9805 4.4224 1.3997 1.7328 1.1869 2.0200 4.1144 2.2789 1.3620 1.4160 2.4479 1.3544 2.0811 1.8316 1.8999 1.9366 1.5783 1.6013 1.1399 2.5693 1.6155 1.3589 1.3421 2.1228 1.2928 1.4176 1.6499 1.2197 4.2830 1.1977 2.7109 2.2079 1.0663 1.0835 1.0705 1.0456 1.0955 1.1104 6.2778 6.0120 1.0372 1.0620 1.0350 1.0610 1.0978 1.1002 1.0997 1.1002 1.1007 1.1010 1.0862 1.0917 1.0991 1.0742
irintensity: 1.5763 0.5171 0.0370 0.3328 2.7096 0.2125 2.1940 1.5554 9.4563 1.6567 22.1708 11.1811 7.5481 91.8250 11.5955 11.4700 1.1088 19.9452 0.4617 7.2800 19.8860 14.1848 1.0656 27.1997 1.7303 15.0424 1.1738 37.6824 0.8964 1.0132 6.4093 1.6344 15.5397 15.7854 4.2567 0.4993 3.6568 12.9812 8.1268 2.2403 3.7967 11.6875 18.4153 0.2763 2.2692 10.1096 12.7156 12.0930 6.4728 9.3133 9.3905 16.5386 7.5031 4.6502 13.1805 20.1691 18.9985 29.3802 30.3277 19.4912 43.3934 31.0008 3.8911 3.9351 54.2838 37.5970 30.6938 24.6779 1.5082 21.5700 30.0666 9.4711
temp: 298.150 k
press: 1.00000 atm
elementType: 17 7 6 6 6 6 6 6 6 6 6 6 1 1 1 1 1 1 1 1 1 1 1 1 1 1
symmnumber: 1
zpe: 566701.1 jmol-1
zpe.correction: 0.215845 hartree
zpe.thermalcorrener: 0.228847 hartree
zpe.thermalcorrenthalpy: 0.229791 hartree
zpe.thermalcorrgfe: 0.175702 hartree
zpe.sumelectzpe: -903.334224 hartree
zpe.sumelectthermal: -903.321222 hartree
zpe.sumelectthermalent: -903.320278 hartree
zpe.sumelectthermalfe: -903.374368 hartree
dipole: -2.3520 2.4927 0.6135
dipole: 3.4817
quadrupole: -71.6526 -79.1474 -82.9651
quadrupole: 4.4695 -0.6266 -4.1191
quadrupole: 6.2691 -1.2257 -5.0434 4.4695 -0.6266 -4.1191
hfenergy: -903.5500692 hartree
pointgroup: C01 [X(C10H14Cl1N1)]
dipole: -0.7165931 1.0995293 0.3922617 debye
dipolederiv: -0.1703264 -0.0531782 -0.042039 0.0278791 -0.9075784 -0.2217297 0.0549813 -0.9261745 -0.481879 -0.0722034 0.2037943 0.0460279 -0.0643378 0.904732 0.4812112 -0.0949678 0.8179916 0.1660076 0.2921835 0.0819931 0.1693333 -0.3110075 0.1792944 -0.0466827 0.0725351 -0.0238195 -0.0136811 0.2098197 -0.1267373 -0.1335098 0.239449 0.2106186 0.0018042 -0.0516414 -0.1471341 -0.0499465 -0.0988258 0.0086482 -0.0226195 0.0124801 -0.3631795 -0.1991536 0.009352 0.3054999 -0.0277759 0.0042331 0.0679052 -0.0774427 0.1178079 0.0334247 -0.0024084 -0.2354162 -0.0069615 -0.0314494 0.0155804 -0.0493127 0.0322739 -0.0469304 0.0572365 0.0246055 0.1499641 0.0143592 0.0145272 -0.1316829 0.1969016 -0.0162329 0.3516411 -0.1579216 0.016017 -0.0467314 0.0227639 -0.1661637 -0.1176089 -0.226621 -0.0152675 -0.2901511 -0.2435547 -0.0074449 0.0233561 0.0168569 -0.1606428 0.2218309 0.0451619 0.0089884 -0.0084643 0.1304213 -0.0675716 -0.0125464 -0.047951 -0.0947827 -0.0069838 0.0010042 -0.0249069 0.0095908 0.0864787 0.0494662 0.131376 0.0255852 0.0398529 0.024261 -0.0148108 0.0370378 -0.0546079 0.0721955 0.018855 -0.058079 0.0048171 0.0155699 0.0712498 -0.0322476 -0.0372444 0.0423705 -0.0251614 -0.073367 0.0110427 -0.051866 0.0261518 -0.0692784 -0.0462611 0.0634536 -0.1098037 0.0052543 0.1077003 0.0755945 0.0695108 -0.0013041 -0.0505953 0.0402177 -0.0578589 0.1051457 0.0198775 0.0938676 -0.0641053 0.0567767 0.005542 0.0561647 0.032971 0.0488116 -0.0485933 -0.0727407 -0.0846285 0.0199115 -0.0553544 0.0132017 -0.0732337 -0.1057385 0.0216472 -0.064207 0.0421445 0.0084579 0.0253201 0.0158915 0.1443654 -0.0833995 0.1068259 -0.0129506 0.0698259 0.0414797 0.0072598 -0.0022914 0.0268779 0.1457775 0.0834034 0.0039356 0.0015043 0.002984 -0.1224136 0.0477202 0.0043338 0.0377562 0.1398364 0.096168 0.0073666 -0.0137031 -0.0482692 -0.1016643 -0.134965 -0.0231758 -0.059806 -0.0021018 -0.169111 0.117757 -0.0611334 0.1470582 0.0409982 0.0230403 -0.0664828 0.0071219 0.0449368 0.0279657 -0.0871744 0.104131 -0.0593387 0.0296073 0.0613343 0.064482 0.0273262 0.0355763 -0.0280646 0.105165 -0.0984324 0.0897727 0.0151412 0.0709504 -0.0602586 0.0336429 0.0113383 -0.1625006 -0.1139805 0.058135 -0.1426145 0.0437756 0.0281626 0.05599 0.0063781 0.0502768 0.1045345 -0.0046061 0.0121922 0.0513358 -0.0908868 -0.1184408 0.0054283 -0.0468196 0.0243141 0.0264195 -0.1589791 0.0098046 -0.0190152 0.1724209 -0.0840605 0.0120284 -0.1232693 0.1524525 unknown
polarizability: 144.098974|-3.4477824|167.6200238|-3.1640252|7.7135011|89.009101 unknown
InChI: InChI=1S/C10H14ClN/c1-3-8-6-5-7-9(4-2)10(8)12-11/h5-7,12H,3-4H2,1-2H3
charge 0 multiplicity 1
26 atoms
Cl 0.284152 -2.846452 -1.324033
N  0.092481 -1.681999 0.324074
C  1.2658 0.39429 -0.184487
C  -1.238692 0.381546 -0.14907
C  0.020298 -0.303929 -0.028993
C  2.591596 -0.335756 -0.070071
C  -2.563381 -0.357544 -0.02329
C  1.225894 1.786549 -0.418562
C  -1.224711 1.779373 -0.356953
C  -0.004768 2.478738 -0.493786
C  3.007578 -0.566706 1.409475
C  -3.026453 -0.535585 1.450705
H  2.527108 -1.316424 -0.573694
H  3.374476 0.253827 -0.583966
H  -3.339783 0.211273 -0.566846
H  -2.505119 -1.347387 -0.518729
H  2.168861 2.332538 -0.539038
H  -2.176056 2.31919 -0.434415
H  -0.013163 3.559797 -0.672914
H  3.097826 0.390477 1.954964
H  3.982825 -1.084577 1.456734
H  2.255863 -1.194345 1.916638
H  -2.302229 -1.124198 2.044582
H  -4.001667 -1.053386 1.493258
H  -3.134961 0.445544 1.946402
H  -0.843077 -2.042653 0.595716
