program: Gaussian 09
title: 000177921
version: EM64L-G09RevD.01
frameworkgroup: C1[X(C9H21N)]
method: RPBEPBE
basis: SDD
operation: Freq
keyword: #pfreq=noraman
keyword: PBEPBE/SDD
title: #p freq=noraman PBEPBE/SDD
converged: YES YES NO NO
title: Mulliken charges:
elementType: N C C C C C C C C C H H H H H H H H H H H H H H H H H H H H H
charge: -0.336891 0.016428 -0.434299 -0.397640 -0.369616 -0.327761 -0.709619 -0.386640 -0.698471 -0.680706 0.173518 0.223455 0.171561 0.200330 0.206854 0.238814 0.210466 0.194573 0.201085 0.169619 0.203514 0.247127 0.211131 0.183221 0.218147 0.212277 0.215528 0.208050 0.209716 0.208030 0.218202
chargesum: 0.00000
title: Mulliken charges with hydrogens summed into heavy atoms:
elementType: N C C C C C C C C C
charge: -0.098077 0.189946 -0.039284 0.009543 0.035423 0.042943 -0.047847 0.014728 -0.062617 -0.044758
polarizability: 1.28820532e+02 6.30151697e-01 9.95615915e+01 1.40460636e-01 1.03449450e+00 9.13392291e+01
1716.lowfreq: -3.1889 0.0006 0.0007 0.0009 8.9988 17.3808 41.9629 53.1683 68.8620
frequency: 41.9012 52.9065 68.8300 84.0392 89.1351 113.4648 169.9293 187.4281 214.3487 229.4448 242.9062 268.1919 287.3242 321.1099 335.6993 456.0163 506.1207 574.6276 662.8093 740.6945 756.1318 776.8487 798.5482 883.5757 892.4400 895.6101 904.4394 976.1625 989.9542 1020.6017 1043.2207 1055.0625 1077.7892 1102.2625 1108.2666 1126.7538 1143.9432 1164.4021 1180.9347 1224.1831 1230.1788 1261.7145 1269.9573 1278.9897 1286.2362 1294.4094 1320.1174 1330.2654 1355.8304 1359.4552 1373.9989 1383.4042 1389.1269 1390.8655 1461.6770 1463.2870 1472.8093 1473.3579 1477.4568 1478.3915 1478.6928 1480.3977 1483.4135 1486.2327 1494.9157 1497.1661 2811.3990 2836.0158 2947.7896 2964.2179 2968.2161 2971.5672 2975.2980 2979.1612 2986.2205 2999.6686 3009.2634 3027.5206 3032.8479 3033.3760 3067.8731 3069.5482 3070.9789 3071.7904 3075.5231 3086.2553 3415.0434
redmass: 2.1697 2.1814 2.3523 1.7358 3.0318 2.3770 1.4585 2.5764 1.2473 1.3252 1.2613 2.0787 3.3850 2.4034 2.5532 2.7855 2.5228 2.0720 1.4813 1.2260 1.0872 1.3920 1.7056 1.3981 1.3305 1.4917 1.8067 1.8375 2.0991 1.4122 2.3224 2.6492 2.1961 1.8807 2.0755 1.9998 1.9747 2.5134 2.2706 1.3783 1.3003 1.1546 1.2281 1.1171 1.1252 1.2585 1.5429 1.3858 1.4243 1.4465 1.5065 1.2581 1.2196 1.2177 1.2425 1.0617 1.0614 1.0603 1.0572 1.0453 1.0485 1.0630 1.0643 1.0735 1.0814 1.0768 1.0809 1.0716 1.0651 1.0648 1.0587 1.0378 1.0361 1.0382 1.0604 1.0822 1.0938 1.0986 1.0987 1.0995 1.1000 1.1000 1.0993 1.1006 1.0992 1.0998 1.0739
irintensity: 0.3861 0.2450 0.1158 0.0614 0.1049 0.8025 0.8525 0.1926 1.8996 1.8246 1.0021 0.6250 0.8538 0.6078 0.5036 5.6106 8.5663 15.1322 67.3298 7.4933 5.5252 8.5254 1.3831 6.9397 0.7393 2.1035 0.6611 13.2702 0.9306 4.3608 4.7883 2.2995 7.0263 14.2472 5.7067 2.4964 14.7782 31.5128 0.4534 1.3370 6.2125 1.3960 1.1341 4.1018 0.3313 0.6027 4.2481 12.4100 12.9557 2.7596 6.6587 27.8274 6.2375 11.3749 25.2094 1.8366 3.2020 4.1369 4.2690 14.2753 14.5136 7.2717 2.5918 26.2603 9.6122 5.2024 80.3718 130.7346 32.3827 30.6199 45.6012 34.9588 36.0573 46.5664 17.3305 45.5251 6.5916 30.5129 2.2527 55.1718 77.1080 60.7257 50.1852 85.9382 50.7424 35.4944 3.4719
temp: 298.150 k
press: 1.00000 atm
elementType: 7 6 6 6 6 6 6 6 6 6 1 1 1 1 1 1 1 1 1 1 1 1 1 1 1 1 1 1 1 1 1
symmnumber: 1
zpe: 750297.7 jmol-1
zpe.correction: 0.285773 hartree
zpe.thermalcorrener: 0.299636 hartree
zpe.thermalcorrenthalpy: 0.300580 hartree
zpe.thermalcorrgfe: 0.244717 hartree
zpe.sumelectzpe: -409.430474 hartree
zpe.sumelectthermal: -409.416612 hartree
zpe.sumelectthermalent: -409.415668 hartree
zpe.sumelectthermalfe: -409.471531 hartree
dipole: 0.0894 -0.8305 0.6604
dipole: 1.0648
quadrupole: -64.9669 -65.3293 -67.7045
quadrupole: -0.5634 0.0340 0.9567
quadrupole: 1.0333 0.6709 -1.7042 -0.5634 0.0340 0.9567
hfenergy: -409.7162474 hartree
pointgroup: C01 [X(C9H21N1)]
dipole: 0.0267064 0.327766 -0.2595209 debye
polarizability: 128.8274127|-0.080762|99.54483|-0.5152321|1.0462869|91.3491097 unknown
InChI: InChI=1S/C9H21N/c1-4-7-9(6-3)10-8-5-2/h9-10H,4-8H2,1-3H3
charge 0 multiplicity 1
31 atoms
N  0.759219 0.321384 0.326022
C  -0.464374 -0.034168 -0.441535
C  -1.691539 0.56135 0.293741
C  -0.557169 -1.573018 -0.647081
C  -3.041745 0.333897 -0.422188
C  2.049635 0.158552 -0.377893
C  -0.650081 -2.383475 0.663024
C  3.21557 0.695745 0.47667
C  -4.205053 1.086477 0.259629
C  4.583317 0.541493 -0.221888
H  -0.435416 0.424831 -1.466976
H  -1.734901 0.148779 1.320805
H  -1.53287 1.656819 0.404428
H  0.332425 -1.90494 -1.218042
H  -1.427506 -1.789716 -1.2967
H  0.678738 1.271503 0.717006
H  -3.273281 -0.74905 -0.447625
H  -2.957586 0.661155 -1.478968
H  2.219984 -0.918256 -0.573812
H  2.058739 0.668783 -1.376978
H  -0.567501 -3.468119 0.464679
H  0.163439 -2.085201 1.347507
H  -1.610375 -2.212707 1.18438
H  3.037024 1.76747 0.706968
H  3.216381 0.160629 1.445533
H  -4.318029 0.769319 1.31361
H  -5.165562 0.898755 -0.254734
H  -4.027424 2.178685 0.256718
H  4.79935 -0.521337 -0.440324
H  4.607506 1.093249 -1.180552
H  5.402285 0.928013 0.411475
