program: Gaussian 09
title: 000177981
version: EM64L-G09RevD.01
frameworkgroup: C1[X(C18H18Cl2N2O2)]
method: RPBEPBE
basis: SDD
operation: Freq
keyword: #p
keyword: freq=noraman
keyword: PBEPBE/SDD
title: #p freq=noraman PBEPBE/SDD
converged: YES YES NO NO
title: Mulliken charges:
elementType: Cl Cl O O N N C C C C C C C C C C C C C C C C C C H H H H H H H H H H H H H H H H H H
charge: -0.061898 -0.038751 -0.243581 -0.244713 -0.137912 -0.409786 0.314907 -0.702637 -0.720317 -0.702687 0.146355 0.457680 0.179279 0.310883 -0.332039 -0.309273 -0.111993 -0.214094 -0.361373 -0.352448 -0.212263 -0.220257 -0.242986 -0.224897 0.254814 0.199842 0.262286 0.206093 0.246766 0.225220 0.273603 0.210424 0.207182 0.325841 0.287315 0.263294 0.274658 0.229329 0.264136 0.235567 0.232868 0.235562
chargesum: 0.00000
title: Mulliken charges with hydrogens summed into heavy atoms:
elementType: Cl Cl O O N N C C C C C C C C C C C C C C C C C C
charge: -0.061898 -0.038751 -0.243581 -0.244713 -0.137912 -0.083945 0.314907 0.014305 -0.042238 -0.011479 0.146355 0.457680 0.179279 0.310883 -0.332039 -0.021958 -0.111993 0.049199 -0.086715 -0.123119 0.051873 0.015310 -0.010117 0.010665
polarizability: 2.41126478e+02 -2.16742067e+01 2.27597173e+02 1.27095010e+00 1.25344284e+01 2.18943895e+02
1716.lowfreq: -10.7227 -5.8467 -4.5759 0.0010 0.0011 0.0012 18.5306 24.9803 28.6160
frequency: 18.4701 24.6999 28.6001 32.4131 53.4700 60.4794 85.1027 96.7587 106.4629 131.6864 138.4753 163.4143 179.8626 184.2117 201.9374 235.7341 245.1800 259.8197 285.2017 294.9010 298.1622 308.2869 325.3021 340.2076 364.9230 377.7594 387.9319 402.4151 406.7564 435.3104 458.6092 471.8633 481.2858 503.5847 508.6904 554.7039 581.1922 614.3545 631.2720 650.3999 687.0360 692.4478 704.5045 709.3110 722.0184 756.7092 794.1755 804.0254 809.1063 858.6150 867.7662 872.5866 899.4773 918.6924 929.8261 940.5810 944.8709 956.3364 987.5946 989.9677 1007.4088 1008.2723 1019.9349 1031.7135 1034.8533 1066.1178 1082.5197 1090.5654 1125.6597 1148.5195 1175.0427 1193.4479 1195.3156 1212.5020 1234.4873 1249.3486 1261.2199 1262.2056 1321.2751 1329.2555 1362.7414 1374.4697 1376.8337 1383.0401 1385.3353 1402.4987 1431.0150 1441.8947 1447.3819 1451.9435 1464.4928 1470.6673 1476.2772 1486.2769 1488.6773 1506.5020 1558.9962 1578.1284 1584.8221 1594.1738 1611.1050 1613.3213 2987.4751 2990.0359 2994.6316 3079.6667 3086.8815 3091.9112 3099.4588 3114.0391 3117.6485 3123.2997 3134.5654 3147.1785 3159.3798 3162.8135 3171.0029 3174.6169 3182.6296 3505.1513
redmass: 9.7247 5.3043 4.1688 6.4908 3.9619 5.5547 5.0723 7.1893 6.3539 6.4217 10.4552 5.7472 3.0404 1.7359 2.5931 1.1522 3.7798 3.0151 2.6794 1.5734 3.7946 19.2700 3.6551 6.1325 2.9038 3.3712 3.9397 2.9512 4.3773 3.1506 3.5892 3.8846 4.4446 3.8723 6.4292 1.2922 4.6079 6.2370 7.3004 6.4149 4.9253 4.9568 1.7443 5.0104 6.4589 4.8484 2.3682 3.5724 1.3565 1.3531 4.9626 4.1207 1.6558 1.6939 1.5785 1.4377 1.3439 1.2072 1.6620 3.5148 1.4074 5.4962 2.6639 1.5476 1.4273 2.4042 2.1207 1.7393 2.0268 2.0122 1.0603 1.4872 1.5891 4.1347 3.0508 1.6292 2.3901 3.0252 1.3811 4.1766 7.9397 1.1946 1.2056 4.8010 8.6615 1.2170 2.0211 2.4734 1.0553 1.6783 1.0767 1.0801 1.0542 1.8637 1.1298 1.0606 6.8217 6.9393 8.2179 8.1708 5.9366 7.4669 1.0362 1.0358 1.0368 1.0999 1.0988 1.0992 1.0997 1.0998 1.1001 1.0872 1.0874 1.0920 1.0958 1.0891 1.1010 1.0932 1.0978 1.0784
irintensity: 0.2732 1.0423 1.0867 0.6835 1.4435 2.3906 2.2245 2.1116 0.8683 1.1577 1.4460 3.5324 0.8922 0.5013 2.5698 0.6300 0.9456 1.4412 3.9854 1.8634 2.5488 0.1225 5.3666 4.3779 0.2390 0.1629 2.0716 1.3090 3.2704 1.7890 13.2640 7.0529 11.5161 5.9326 54.2877 184.1075 6.7272 1.2844 14.5500 13.2081 5.6003 12.2965 55.4133 36.6966 12.1165 13.9672 25.2066 4.3617 40.3073 1.1564 2.5195 14.4055 14.8126 0.7344 4.6747 2.5024 0.3569 0.4025 1.2537 1.0022 4.0494 63.0018 20.0426 1.4310 0.1771 19.8682 33.4498 6.6608 0.6850 9.5264 1.3302 13.4826 42.6606 98.3261 14.8471 14.9683 73.1812 122.0488 14.7002 137.7174 9.5397 41.0606 30.1104 114.1295 1.1134 36.5290 9.6457 35.1893 0.9349 148.5809 6.5229 24.0053 5.2201 27.8960 6.8345 25.5227 13.5835 47.8748 184.3982 8.2196 16.1114 79.5973 16.2168 25.6971 37.1709 5.4747 29.1586 37.1370 39.8446 4.5510 11.3234 5.0574 1.9575 16.3237 13.6193 0.3483 21.2218 1.1464 1.5824 27.5096
temp: 298.150 k
press: 1.00000 atm
elementType: 17 17 8 8 7 7 6 6 6 6 6 6 6 6 6 6 6 6 6 6 6 6 6 6 1 1 1 1 1 1 1 1 1 1 1 1 1 1 1 1 1 1
symmnumber: 1
zpe: 841203.2 jmol-1
zpe.correction: 0.320397 hartree
zpe.thermalcorrener: 0.344117 hartree
zpe.thermalcorrenthalpy: 0.345061 hartree
zpe.thermalcorrgfe: 0.264938 hartree
zpe.sumelectzpe: -1875.046384 hartree
zpe.sumelectthermal: -1875.022664 hartree
zpe.sumelectthermalent: -1875.021720 hartree
zpe.sumelectthermalfe: -1875.101844 hartree
dipole: 0.1736 4.7940 3.7096
dipole: 6.0641
quadrupole: -143.9700 -153.4516 -154.7483
quadrupole: -2.4155 -6.9353 0.8369
quadrupole: 6.7534 -2.7283 -4.0250 -2.4155 -6.9353 0.8369
hfenergy: -1875.3667815 hartree
pointgroup: C01 [X(C18H18Cl2N2O2)]
dipole: 1.6966796 -0.1289537 -1.6723356 debye
polarizability: 225.1330514|-23.4600559|240.4640193|-10.2110403|-1.3166376|222.0704752 unknown
InChI: InChI=1S/C18H18Cl2N2O2/c1-18(2,3)22(21-16(23)12-7-5-4-6-8-12)17(24)14-11-13(19)9-10-15(14)20/h4-11,21H,1-3H3
charge 0 multiplicity 1
42 atoms
Cl -1.489178 -0.392258 -2.744258
Cl -1.628852 -4.000533 2.575913
O  -3.128503 1.075692 0.702156
O  1.034755 0.986241 1.766211
N  -0.991025 1.623523 -0.082374
N  0.260163 1.089542 -0.431105
C  -1.155612 3.138751 0.094187
C  -1.42285 3.449335 1.590383
C  0.148215 3.835223 -0.356193
C  -2.331419 3.60759 -0.802208
C  -2.004015 0.720769 0.243041
C  -1.702824 -0.756604 0.048439
C  1.212441 0.745854 0.536366
C  2.45766 0.096072 -0.003002
C  -1.527115 -1.388438 -1.201894
C  -1.74526 -1.577558 1.204741
C  -1.590165 -2.968316 1.079547
C  -1.389298 -2.782866 -1.3313
C  3.629357 0.175811 0.79265
C  2.499401 -0.60373 -1.238813
C  -1.41481 -3.589846 -0.172763
C  4.831826 -0.411918 0.350282
C  3.70413 -1.195008 -1.677045
C  4.873874 -1.09451 -0.888807
H  -0.600775 3.056889 2.212494
H  -1.489765 4.544217 1.728091
H  -2.36961 2.995531 1.922345
H  0.392558 3.622344 -1.412473
H  1.005491 3.549626 0.276278
H  0.002339 4.925118 -0.258012
H  -3.269584 3.107001 -0.517541
H  -2.466444 4.69754 -0.681833
H  -2.122157 3.39843 -1.867109
H  0.449232 0.980359 -1.430651
H  -1.901169 -1.112501 2.181917
H  -1.268163 -3.23827 -2.3180
H  3.569083 0.69496 1.754717
H  1.595336 -0.732307 -1.846303
H  -1.306842 -4.674978 -0.249963
H  5.733177 -0.341825 0.96853
H  3.728043 -1.741769 -2.62587
H  5.807456 -1.553481 -1.23227
