program: Gaussian 09
title: 000177909
version: EM64L-G09RevD.01
frameworkgroup: C1[X(C6H10O5)]
method: RPBEPBE
basis: SDD
operation: Freq
keyword: #pfreq=noraman
keyword: PBEPBE/SDD
title: #p freq=noraman PBEPBE/SDD
converged: YES YES NO NO
title: Mulliken charges:
elementType: O O O O O C C C C C C H H H H H H H H H H
charge: -0.270038 -0.422207 -0.403311 -0.147994 -0.433103 -0.021154 -0.501429 0.076607 -0.341265 0.132831 -0.344952 0.233440 0.250032 0.248529 0.239234 0.212983 0.197885 0.217097 0.365065 0.356734 0.355015
chargesum: 0.00000
title: Mulliken charges with hydrogens summed into heavy atoms:
elementType: O O O O O C C C C C C
charge: -0.270038 -0.057141 -0.046576 -0.147994 -0.078088 0.212287 -0.002868 0.076607 0.110951 0.132831 0.070030
polarizability: 9.48305515e+01 -3.17921540e-01 8.15531431e+01 2.24100505e+00 2.65052713e-01 6.41236933e+01
1716.lowfreq: -13.2777 -4.7749 0.0010 0.0010 0.0012 4.9898 43.6922 70.3088 117.2727
frequency: 43.6144 70.2955 117.2569 168.7651 201.2663 233.5330 282.4100 314.1889 323.4331 360.1233 375.8207 411.1199 450.3379 455.0390 469.5114 532.3425 556.5161 597.0652 667.1525 706.7599 777.1873 855.2289 892.6020 957.0776 991.4160 1009.9227 1025.2783 1040.2205 1051.4353 1057.2383 1100.2555 1153.7426 1184.6306 1204.4246 1244.0343 1248.8619 1283.1584 1306.2075 1319.9034 1322.4506 1348.2748 1376.1245 1387.4989 1415.9833 1443.4850 1459.3460 1647.6664 2951.2142 2967.4561 2970.0628 2994.1269 3077.3376 3079.1459 3086.1211 3527.0615 3537.5418 3539.0264
redmass: 5.8171 5.7442 3.4991 3.5875 4.8396 4.0239 3.7355 1.1973 4.3039 3.0663 3.2813 5.3703 1.5805 1.9121 1.3968 2.0800 3.2783 4.7356 4.2729 4.6636 3.0643 3.2774 1.9569 3.2898 3.7038 4.1275 2.1599 2.4686 3.0251 6.6952 2.0293 2.0110 1.3379 1.3961 1.2945 1.2259 1.4652 1.3393 1.4085 1.5805 1.2928 1.4375 1.3129 1.0884 1.0818 1.0847 10.9552 1.0786 1.0732 1.0636 1.0614 1.0998 1.0982 1.0967 1.0656 1.0653 1.0652
irintensity: 2.6967 4.4498 5.6322 1.1192 3.1634 4.7380 4.3399 128.2486 3.3612 22.8096 28.3160 15.3476 27.5003 32.1193 166.8029 128.2853 49.5924 14.0257 5.6418 16.3478 24.7012 40.4086 27.8225 83.7904 97.6850 110.1669 53.8334 85.1826 18.7531 50.1471 6.6413 24.4151 22.9944 26.6942 10.4355 7.2102 10.9191 39.2882 3.2800 32.2666 32.3372 11.8728 19.4055 14.6126 11.2941 4.5867 148.9281 8.3757 75.9859 46.6382 10.8317 14.0581 0.1848 32.8200 15.3410 14.5077 10.5482
temp: 298.150 k
press: 1.00000 atm
elementType: 8 8 8 8 8 6 6 6 6 6 6 1 1 1 1 1 1 1 1 1 1
symmnumber: 1
zpe: 425686.9 jmol-1
zpe.correction: 0.162136 hartree
zpe.thermalcorrener: 0.173411 hartree
zpe.thermalcorrenthalpy: 0.174355 hartree
zpe.thermalcorrgfe: 0.125095 hartree
zpe.sumelectzpe: -609.833675 hartree
zpe.sumelectthermal: -609.822400 hartree
zpe.sumelectthermalent: -609.821456 hartree
zpe.sumelectthermalfe: -609.870715 hartree
dipole: -0.9822 -1.5018 1.1223
dipole: 2.1165
quadrupole: -77.8049 -61.9824 -65.0226
quadrupole: 11.1062 -2.7244 6.3044
quadrupole: -9.5349 6.2875 3.2474 11.1062 -2.7244 6.3044
hfenergy: -609.9958107 hartree
pointgroup: C01 [X(C6H10O5)]
dipole: -0.3847654 -0.6184035 0.4036131 debye
dipolederiv: -0.871351 -0.1945762 -0.0487179 -0.1989904 -0.6991252 -0.1165108 -0.0305227 -0.0740152 -0.3964803 -0.4349309 -0.2608623 0.1137637 -0.2523139 -0.4552979 0.0776073 0.0084789 -0.0295516 -0.8663232 -0.8685882 -0.1418115 -0.1938526 -0.1017092 -0.189855 -0.1755662 -0.0837996 -0.1680716 -0.6938226 -0.6781169 0.1862948 -0.109295 0.2474154 -0.7021063 0.1126035 -0.2098458 0.1148776 -0.2860624 -0.7214117 0.2604178 -0.0567104 0.3553715 -0.4495669 -0.1220333 -0.0498095 -0.1087691 -0.5366516 0.3210022 0.0777996 -0.0762954 0.076121 0.5975936 0.0014354 -0.2513494 -0.0146174 0.3204477 -0.5780507 0.1091671 -0.0977143 -0.0543827 -0.0862901 -0.0551482 -0.1312848 -0.071155 0.0194649 0.6928321 0.1468877 0.0510098 0.2007083 0.1428577 0.0728978 0.0515858 0.1356471 0.9544333 0.5309215 0.1288445 0.0968286 0.1202593 0.2401709 0.0253468 0.1126569 0.1403072 0.3276182 0.9588084 -0.0597448 0.2741275 -0.0660772 0.8606514 -0.1189758 0.4485047 -0.1991836 0.0829912 0.464538 -0.1906064 -0.068562 -0.1411037 0.3875725 0.1018019 -0.0188429 0.0653697 0.4106826 0.0306972 0.011577 -0.0308395 -0.0379861 -0.0223343 -0.0219204 0.035938 0.0480138 -0.1689994 0.056771 -0.024722 0.0030691 -0.0556252 -0.0886044 0.0150906 0.0175577 0.0348235 0.0988302 0.0996966 -0.003999 -0.0046443 -0.0202571 0.113351 0.0535188 0.0200523 0.0100248 -0.0420863 0.0275374 -0.0525746 -0.0131429 -0.0653394 -0.0963966 0.0068427 -0.0024809 0.050109 0.0986118 -0.016784 -0.0292802 0.0051955 0.0077252 0.0842352 0.0566518 -0.0335197 -0.0498189 -0.160031 -0.0006093 0.044541 0.0722036 0.0426746 0.0455125 0.018362 0.0309502 -0.0391462 -0.2054208 0.0413779 -0.0467985 0.0120627 -0.0437388 -0.1118122 0.0053996 0.0298175 0.04762 0.0789692 0.212392 0.1606894 0.026988 0.1879332 0.2245496 -0.016526 -0.0047717 -0.0015761 0.3101994 0.367153 0.0230858 -0.0279942 -0.0429631 0.0476306 0.0572126 -0.0254433 0.0845027 0.3398571 0.3661153 -0.1443294 0.0725202 -0.1577217 0.1572638 0.0219098 0.0861285 0.0246094 0.313772 unknown
polarizability: 94.7776492|-0.3084351|81.4635775|2.5950052|1.238641|64.2661613 unknown
InChI: InChI=1S/C6H10O5/c7-2-4-1-5(8)6(9,10)3-11-4/h4,7,9-10H,1-3H2
charge 0 multiplicity 1
21 atoms
O  1.015668 -1.035692 0.05983
O  -1.701575 -0.879539 1.344054
O  -2.607901 -0.679983 -0.871769
O  -1.878119 1.914167 -0.4061
O  3.718741 -0.410542 -0.320474
C  1.381185 0.368905 -0.239201
C  0.349605 1.316075 0.41882
C  -1.437342 -0.490715 -0.046866
C  -0.270847 -1.386488 -0.533165
C  -1.066995 1.023393 -0.065523
C  2.801093 0.530951 0.315969
H  1.393634 0.505494 -1.343127
H  0.583043 2.375679 0.215798
H  0.387188 1.14374 1.513206
H  -0.467538 -2.430828 -0.235383
H  -0.228355 -1.306142 -1.640145
H  2.775708 0.39032 1.418069
H  3.191673 1.536324 0.087314
H  -2.463782 -0.336051 1.679005
H  -2.885768 -1.631742 -0.810587
H  3.311584 -1.312027 -0.233325
