program: Gaussian 09
title: 000177898
version: EM64L-G09RevD.01
frameworkgroup: C1[X(C10H3Cl5)]
method: RPBEPBE
basis: SDD
operation: Freq
keyword: #pfreq=noraman
keyword: PBEPBE/SDD
title: #p freq=noraman PBEPBE/SDD
converged: NO YES NO YES
title: Mulliken charges:
elementType: Cl Cl Cl Cl Cl C C C C C C C C C C H H H
charge: 0.017681 0.014243 0.016459 0.056292 0.012573 0.514005 0.529492 -0.414408 -0.307399 -0.291568 -0.412227 -0.098163 -0.118791 -0.130587 -0.219172 0.290635 0.274470 0.266468
chargesum: 0.00000
title: Mulliken charges with hydrogens summed into heavy atoms:
elementType: Cl Cl Cl Cl Cl C C C C C C C C C C
charge: 0.017681 0.014243 0.016459 0.056292 0.012573 0.514005 0.529492 -0.123773 -0.307399 -0.291568 -0.137757 -0.098163 -0.118791 -0.130587 0.047296
polarizability: 2.59547701e+02 1.04340022e+01 1.83336316e+02 -3.63417224e-04 2.26322058e-03 5.39922039e+01
1716.lowfreq: -6.7732 -0.0023 -0.0003 0.0016 2.6988 4.9052 52.9429 58.6991 86.0315
frequency: 52.9387 58.6978 86.0302 140.8673 141.6745 186.8186 202.2892 210.9162 226.0148 254.4951 290.1231 296.9343 329.7793 332.2152 403.6765 442.8506 486.8623 494.7994 554.6037 559.1788 570.7170 639.1082 674.7643 689.1185 747.0312 764.6082 826.3498 859.6873 888.9052 889.5215 966.8020 983.9550 1141.4628 1159.5640 1161.8371 1243.2398 1267.0684 1348.9243 1382.3758 1392.6141 1415.3663 1464.7381 1548.0277 1568.7664 1607.9248 3165.3285 3184.6767 3185.5840
redmass: 21.5180 19.0885 14.2377 22.0039 7.0245 31.7096 29.8286 31.6850 7.6079 20.7738 25.1232 5.7234 7.1311 27.8048 10.1417 8.3833 5.7564 13.0004 6.3672 4.3993 5.2604 9.8111 8.4321 10.1348 10.2206 3.3286 1.6385 5.6532 8.6577 1.5186 1.3329 11.1306 2.2446 2.2553 2.0471 2.0512 3.2733 3.7181 5.9900 4.1060 6.6799 4.1569 9.8847 8.0668 7.8023 1.0883 1.0920 1.0973
irintensity: 0.1914 0.1851 0.3398 0.2769 0.3889 0.0003 0.0222 0.0131 0.2246 0.0072 0.0937 4.3409 1.7965 0.8045 8.6300 3.5760 0.9927 28.3523 9.3894 0.0022 5.8724 21.9935 0.3719 4.4832 81.8092 1.5862 42.3841 6.6401 37.6896 24.2822 0.9813 14.6759 25.2266 88.0157 18.2724 33.5231 66.2100 17.5267 49.4120 7.0920 6.4672 70.8657 1.5394 41.3617 27.4378 0.4336 4.2663 1.1382
temp: 298.150 k
press: 1.00000 atm
elementType: 17 17 17 17 17 6 6 6 6 6 6 6 6 6 6 1 1 1
symmnumber: 1
zpe: 254145.6 jmol-1
zpe.correction: 0.096799 hartree
zpe.thermalcorrener: 0.110275 hartree
zpe.thermalcorrenthalpy: 0.111219 hartree
zpe.thermalcorrgfe: 0.054929 hartree
zpe.sumelectzpe: -2682.124097 hartree
zpe.sumelectthermal: -2682.110621 hartree
zpe.sumelectthermalent: -2682.109677 hartree
zpe.sumelectthermalfe: -2682.165967 hartree
dipole: -0.8531 -1.3943 0.0000
dipole: 1.6345
quadrupole: -127.7253 -113.5148 -121.9033
quadrupole: 3.8853 0.0001 0.0001
quadrupole: -6.6775 7.5330 -0.8555 3.8853 0.0001 0.0001
hfenergy: -2682.2208958 hartree
pointgroup: C01 [X(C10H3Cl5)]
dipole: 0.3812478 -0.5178811 0.0000134 debye
dipolederiv: -0.126903 -0.1594643 0.0000037 -0.2423277 -0.6326862 0.000015 0.0000075 0.0000191 -0.0143504 -0.1382728 -0.155903 0.000004 -0.2869174 -0.5928127 0.0000128 0.0000017 0.0000021 -0.0146644 -0.4279636 0.3074633 -0.0000039 0.4560683 -0.447279 0.0000052 -0.0000068 0.0000048 -0.017975 -0.7534957 -0.0703489 0.0000093 -0.1637902 -0.0095354 0.0000018 0.0000205 0.0000016 0.0129719 -0.8707803 -0.0290827 -0.0000117 -0.1285665 -0.0499888 -0.0000009 -0.0000141 -0.0000007 -0.0198996 0.1506241 -0.1917936 0.000002 -0.1499959 -0.1377584 0.0000077 0.0000013 -0.0000015 0.0652755 -0.0253935 -0.152563 0.0000026 -0.0776973 -0.2547414 0.0000048 0.0000039 0.0000115 0.055932 -0.3137862 0.1979208 -0.0000034 0.0302267 -0.1875479 0.0000025 0.0000045 0.0000027 -0.1010447 0.0593691 0.2614098 -0.0000049 0.3629593 0.9367493 -0.000025 -0.0000052 -0.0000326 -0.0453626 -0.1177441 0.3523431 -0.0000111 0.4545819 0.8515154 -0.0000217 -0.0000149 -0.0000013 -0.0643962 0.0097707 0.0383366 0.0000004 -0.1228979 0.0192761 -0.0000033 -0.0000009 -0.0000123 -0.1445532 0.4541204 -0.5918961 0.0000104 -0.6167381 0.7642777 -0.0000107 0.000016 -0.0000106 -0.0379158 0.9519672 0.2564401 -0.0000194 0.3114269 -0.3156607 0.0000044 -0.0000342 0.0000067 -0.0379833 1.2381474 0.0254318 0.0000239 0.1918939 -0.0977897 0.0000068 0.0000273 -0.0000015 -0.0428312 -0.3043509 -0.0496301 -0.0000019 -0.077637 0.0609951 -0.0000065 -0.0000006 -0.0000018 -0.0892249 0.1045941 -0.0384446 0.0000011 0.0157981 0.0505192 0.0000009 -0.000002 0.0000019 0.1683326 0.0841466 -0.0557687 0.0000013 0.0016361 0.0118014 0.0000036 0.0000016 0.0000078 0.1646216 0.0259508 0.0555493 -0.0000026 0.0419768 0.0306659 0.0000026 -0.0000058 0.0000041 0.1630679 unknown
polarizability: 260.7675206|-3.7968813|182.1164968|-0.0001688|-0.002286|53.9922039 unknown
InChI: InChI=1S/C10H3Cl5/c11-6-2-1-4-5(8(6)13)3-7(12)10(15)9(4)14/h1-3H
charge 0 multiplicity 1
18 atoms
Cl -1.957271 -2.872392 0.000057
Cl 2.393535 2.520114 -0.00007
Cl -3.10622 2.586287 -0.000038
Cl -4.116974 -0.489084 0.000033
Cl 4.553953 0.087479 0.000033
C  0.430599 0.51256 -0.000028
C  0.007255 -0.876709 -0.000003
C  -0.552101 1.549713 -0.000039
C  -1.403896 -1.148049 0.000007
C  1.841706 0.794624 -0.000045
C  0.99598 -1.912274 0.000005
C  -1.906031 1.236289 -0.000024
C  -2.355465 -0.123006 -0.000004
C  2.777776 -0.239849 -0.000005
C  2.352944 -1.60095 0.000008
H  -0.236902 2.595208 -0.000053
H  0.677486 -2.95721 0.000034
H  3.109526 -2.39045 0.000033
