program: Gaussian 09
title: 000178060
version: EM64L-G09RevD.01
frameworkgroup: C1[X(C19H25N3O4)]
method: RPBEPBE
basis: SDD
operation: Freq
keyword: #p
keyword: freq=noraman
keyword: PBEPBE/SDD
title: #p freq=noraman PBEPBE/SDD
converged: YES YES NO NO
title: Mulliken charges:
elementType: O O O O N N N C C C C C C C C C C C C C C C C C C C H H H H H H H H H H H H H H H H H H H H H H H H H
charge: -0.302144 -0.232985 -0.343389 -0.445219 -0.160679 -0.197068 -0.426374 -0.180142 -0.167239 -0.485666 -0.481402 -0.376081 -0.469442 0.265736 -0.478874 -0.403021 0.186340 0.316111 -0.381013 -0.497090 0.475391 -0.377737 -0.443418 -0.224413 -0.217820 -0.243001 0.276451 0.279289 0.224902 0.250635 0.236503 0.241732 0.294005 0.223091 0.233193 0.249182 0.276903 0.226566 0.223105 0.235970 0.263535 0.221801 0.318240 0.221035 0.268503 0.361977 0.250764 0.231115 0.226784 0.226173 0.229183
chargesum: 0.00000
title: Mulliken charges with hydrogens summed into heavy atoms:
elementType: O O O O N N N C C C C C C C C C C C C C C C C C C C
charge: -0.302144 -0.232985 -0.343389 -0.083243 -0.160679 -0.197068 -0.108135 0.096309 0.112050 -0.010128 -0.003166 0.141015 0.012934 0.265736 0.024595 0.056054 0.186340 0.316111 0.104323 -0.007551 0.475391 -0.126973 -0.212303 0.002371 0.008353 -0.013818
polarizability: 2.81516388e+02 -7.95638789e+00 2.07701432e+02 -5.06575395e-01 1.07372023e+01 2.09302951e+02
1716.lowfreq: -10.7805 -0.0007 0.0003 0.0005 1.4779 4.9019 7.5077 18.0128 27.4213
frequency: 6.3180 17.6997 27.3298 32.8027 37.1571 39.7967 51.4306 68.5932 77.2970 112.6536 119.8496 127.7264 134.5539 164.8421 168.6154 188.1077 194.2753 225.2411 228.3910 239.5874 257.9574 279.1323 289.6422 310.2984 325.4070 347.4975 368.1653 404.6039 408.1843 420.5591 473.5381 499.1975 504.1643 532.4796 543.4967 577.4959 595.0811 601.4071 617.0504 672.5213 694.3118 705.9998 709.2202 719.9190 745.9493 763.8444 796.0670 815.0705 832.6400 856.1845 857.3680 861.1051 870.7679 891.0334 908.7632 913.4924 915.6479 917.4311 935.7707 960.9377 978.9072 980.5497 989.6648 990.8572 997.3323 1010.7733 1013.2641 1026.2296 1034.3968 1062.5564 1068.4205 1084.2884 1096.6291 1097.9825 1108.3947 1146.3753 1152.0000 1159.6845 1168.5578 1171.9449 1177.6698 1180.2055 1183.7082 1186.0825 1190.7976 1214.3029 1231.4661 1234.9918 1236.7867 1255.3381 1262.1187 1274.5075 1302.1896 1302.8271 1305.5634 1326.2520 1330.6834 1332.2261 1335.0052 1335.9620 1341.9450 1352.0078 1367.0444 1384.2112 1388.3406 1406.0130 1441.4035 1443.8211 1458.5178 1464.2213 1466.9269 1472.5951 1472.8716 1485.8283 1486.9545 1501.0965 1503.3921 1565.1377 1588.9390 1595.5564 1614.8390 1618.9507 2942.3140 2955.2092 2971.4968 2999.2620 3003.9932 3004.8284 3010.0810 3013.5288 3024.9133 3030.0362 3034.3294 3035.7672 3060.8041 3067.0465 3079.4927 3089.6196 3098.8346 3110.7881 3113.9972 3123.6956 3135.6281 3146.2052 3163.2144 3432.4121 3569.0704
redmass: 5.1353 5.2974 4.1965 6.2065 4.4941 5.5199 6.2128 4.8762 6.4960 3.3757 3.2908 3.5769 3.5433 3.2534 3.1224 3.2474 3.4721 3.2247 3.3388 4.8505 2.2345 3.6949 3.2920 5.5486 4.4580 6.0988 3.9676 2.8148 1.3234 3.0363 3.8398 1.4154 2.7694 3.6321 3.3211 2.5578 2.3326 3.4098 6.1954 3.3267 5.3087 1.9317 9.1423 5.0651 2.2633 2.6907 3.3834 3.9169 3.2007 1.7867 1.7891 2.4169 1.9953 2.1790 1.6802 1.6122 2.0776 2.0587 2.5735 2.2868 1.5821 2.0783 4.5186 2.2793 1.3717 2.1812 4.3189 2.1894 2.9915 1.9732 1.6680 1.5764 1.9226 1.9446 2.1222 2.0137 1.8744 1.6830 1.3223 1.0539 2.3645 2.0757 1.2000 1.1330 1.7742 2.3162 1.2518 1.2367 1.2393 1.3974 1.6047 1.7273 1.3732 1.3258 1.4142 1.4906 1.3077 1.3667 1.3360 1.5090 1.5744 1.3907 2.3601 1.3988 4.1851 4.1577 2.1417 1.0729 1.0901 1.1081 1.0856 1.1037 1.2581 1.4484 1.4793 1.0925 2.0437 5.8688 5.5404 6.1289 6.0154 7.3270 1.0614 1.0590 1.0638 1.0997 1.0997 1.0583 1.0644 1.0652 1.0643 1.0797 1.0964 1.0621 1.0881 1.1032 1.1035 1.1005 1.1062 1.1052 1.0872 1.0859 1.0911 1.0960 1.1015 1.0643 1.0770
irintensity: 0.0562 1.0844 0.4932 0.1933 2.9762 0.3951 6.6667 1.3011 11.7034 2.2774 4.4836 1.9186 0.3486 1.5350 4.8800 0.4198 0.7595 6.7645 3.2309 15.4457 7.0642 4.0979 3.4412 3.3054 29.3442 6.5382 26.6852 1.3230 111.9024 0.7756 5.0160 103.7392 15.9028 3.6558 20.1853 4.8639 1.7803 18.5238 1.1587 13.5167 4.0066 43.1838 15.7522 6.9868 22.6844 34.6711 1.6279 2.3210 2.1400 0.6870 0.6970 18.1188 6.0694 2.0635 40.7685 8.7667 4.3625 3.3068 6.9409 4.9529 5.6500 16.6311 1.2442 5.3031 1.2368 15.4121 148.5951 10.3905 7.8411 1.0090 4.8506 16.1689 5.8567 1.5590 10.3046 14.3154 6.1660 8.5474 3.3085 0.0673 18.5985 21.0434 2.7088 5.4040 16.0624 2.5011 56.7160 4.3097 6.2520 92.6102 13.3494 18.0138 8.0645 1.8255 36.8944 27.2344 3.2141 19.1824 43.0708 38.3464 116.6582 36.1698 139.6682 49.0820 2.0072 80.5821 26.6978 20.3276 14.4596 43.2435 10.8556 24.5538 40.8097 85.8719 55.4240 6.7245 393.5915 136.6417 299.4991 10.9089 8.0395 56.7965 60.8011 38.7663 61.9360 15.3300 21.0807 24.5042 22.6907 11.2684 35.6585 22.8643 14.5794 44.9173 10.5041 17.8274 20.3593 12.4441 26.7736 24.0272 9.1705 0.8265 13.3193 42.6987 23.2031 19.6660 13.1643
temp: 298.150 k
press: 1.00000 atm
elementType: 8 8 8 8 7 7 7 6 6 6 6 6 6 6 6 6 6 6 6 6 6 6 6 6 6 6 1 1 1 1 1 1 1 1 1 1 1 1 1 1 1 1 1 1 1 1 1 1 1 1 1
symmnumber: 1
zpe: 1101379.9 jmol-1
zpe.correction: 0.419493 hartree
zpe.thermalcorrener: 0.444763 hartree
zpe.thermalcorrenthalpy: 0.445707 hartree
zpe.thermalcorrgfe: 0.359323 hartree
zpe.sumelectzpe: -1202.241977 hartree
zpe.sumelectthermal: -1202.216707 hartree
zpe.sumelectthermalent: -1202.215763 hartree
zpe.sumelectthermalfe: -1202.302147 hartree
dipole: 4.1724 1.6021 1.7958
dipole: 4.8167
quadrupole: -164.6322 -137.3085 -159.0314
quadrupole: 1.2141 -18.2275 -3.0721
quadrupole: -10.9748 16.3488 -5.3740 1.2141 -18.2275 -3.0721
hfenergy: -1202.6614702 hartree
pointgroup: C01 [X(C19H25N3O4)]
dipole: 1.6252696 0.8326302 0.506412 debye
polarizability: 281.5095281|-7.4068172|214.1641743|3.6036812|8.9511771|202.8470684 unknown
InChI: InChI=1S/C19H25N3O4/c23-13-17(24)15-8-4-10-21(15)18(25)16-9-5-11-22(16)19(26)20-12-14-6-2-1-3-7-14/h1-3,6-7,15-16,20,23H,4-5,8-13H2
charge 0 multiplicity 1
51 atoms
O  -1.938556 0.032835 -1.523991
O  -5.268326 -0.347336 0.057689
O  0.669658 1.011801 1.606218
O  -5.938955 -2.263929 -1.731385
N  -2.448143 0.110221 0.724227
N  0.289093 1.875585 -0.52807
N  2.479309 1.326522 0.152222
C  -1.167206 2.017554 -0.282725
C  -3.048345 -1.241742 0.629883
C  -1.606962 2.98654 -1.41279
C  -3.251755 -1.65016 2.120183
C  -2.49333 0.667754 2.107737
C  -3.451254 -0.295848 2.846616
C  -1.877891 0.648817 -0.402154
C  -0.637419 2.665691 -2.580556
C  0.702334 2.333801 -1.875371
C  -4.372248 -1.21334 -0.14675
C  1.121653 1.384157 0.46816
C  -4.596829 -2.298531 -1.192734
C  3.467239 0.823476 1.115363
C  4.325411 -0.30997 0.559642
C  3.736603 -1.379922 -0.162292
C  5.724216 -0.324016 0.783512
C  4.5309 -2.442795 -0.645094
C  6.521879 -1.388771 0.304198
C  5.927159 -2.451884 -0.412645
H  -1.321595 2.443355 0.72148
H  -2.353693 -1.919432 0.100881
H  -1.474506 4.028299 -1.066601
H  -2.66218 2.84269 -1.695626
H  -4.101473 -2.339755 2.260847
H  -2.335861 -2.154069 2.477591
H  -1.470881 0.675549 2.527035
H  -2.888021 1.698751 2.102993
H  -3.22231 -0.358078 3.923602
H  -4.494846 0.041963 2.725187
H  -1.003517 1.776414 -3.11703
H  -0.533454 3.504123 -3.289713
H  1.353283 3.230945 -1.799215
H  1.254061 1.54224 -2.419613
H  -3.838122 -2.132509 -1.988317
H  -4.406416 -3.296612 -0.747003
H  2.809846 1.627817 -0.764163
H  4.121747 1.646489 1.466865
H  2.877814 0.482178 1.987636
H  -6.358976 -1.4200 -1.400089
H  2.655035 -1.373348 -0.341953
H  6.192025 0.501624 1.33504
H  4.063617 -3.264682 -1.199565
H  7.602822 -1.385803 0.484817
H  6.543269 -3.276556 -0.788179
