program: Gaussian 09
title: 000177911
version: EM64L-G09RevD.01
frameworkgroup: C1[X(C12H5Cl5O)]
method: RPBEPBE
basis: SDD
operation: Freq
keyword: #p
keyword: freq=noraman
keyword: PBEPBE/SDD
title: #p freq=noraman PBEPBE/SDD
converged: NO YES NO NO
title: Mulliken charges:
elementType: Cl Cl Cl Cl Cl O C C C C C C C C C C C C H H H H H
charge: 0.014606 -0.010321 0.041702 0.044799 0.012016 -0.408700 0.441401 0.471722 -0.569142 -0.440241 -0.323181 -0.387595 0.450516 -0.050815 -0.071794 -0.228363 -0.315692 -0.111857 0.257994 0.279714 0.267571 0.266960 0.368697
chargesum: 0.00000
title: Mulliken charges with hydrogens summed into heavy atoms:
elementType: Cl Cl Cl Cl Cl O C C C C C C C C C C C C
charge: 0.014606 -0.010321 0.041702 0.044799 0.012016 -0.040003 0.441401 0.471722 -0.311147 -0.160527 -0.323181 -0.120024 0.450516 -0.050815 -0.071794 0.038597 -0.315692 -0.111857
polarizability: 3.03223258e+02 -6.43749674e+00 1.80965664e+02 4.08713693e+00 3.36016712e-01 9.21418078e+01
1716.lowfreq: -7.5677 -2.7361 0.0026 0.0026 0.0029 4.1906 28.4059 36.4132 50.4041
frequency: 28.3920 36.4119 50.3967 79.8929 96.6116 139.5941 161.6042 191.4148 193.9526 210.9392 215.2113 237.0782 239.2861 256.2003 292.0318 328.1674 336.5627 360.9447 372.5086 444.7169 452.7083 469.2539 509.4489 519.3950 539.4606 543.1458 581.6061 602.6350 640.5896 711.9172 721.7231 733.5006 737.9194 817.5377 831.9209 854.7647 866.1555 921.4564 953.0155 1022.5538 1031.2360 1102.1863 1137.4421 1157.9208 1165.3774 1208.3774 1241.6982 1303.8248 1333.5735 1350.4681 1381.6281 1399.4031 1431.9723 1478.0257 1540.3407 1579.2464 1581.6503 1596.5330 3141.9614 3157.0839 3171.3719 3181.9104 3582.8423
redmass: 13.3827 14.5263 14.4371 21.0577 12.0764 8.7421 14.7597 13.4087 16.4796 20.2460 17.7041 6.4084 6.7276 8.6225 5.6343 16.7720 3.6450 1.5030 11.6979 6.1742 8.9587 10.7736 4.6738 5.8558 8.5254 5.3794 7.5519 5.2188 5.3246 3.6678 7.4738 6.5508 8.5852 1.5122 5.9118 1.5318 1.5143 8.4525 1.3526 5.8170 7.8727 3.0253 1.6436 1.3766 2.3276 1.5540 1.6920 3.0076 4.4787 8.0222 7.9612 3.9169 3.0538 3.8795 7.7435 7.1158 7.4338 6.8414 1.0921 1.0893 1.0925 1.0967 1.0662
irintensity: 0.6632 0.5878 0.6807 0.2895 0.2681 0.5264 0.1876 0.2576 0.4309 0.3114 0.0610 0.6603 1.8106 5.7462 14.6285 4.8359 32.0399 85.7574 2.7402 0.4411 22.1194 6.9329 1.6600 9.1927 17.6711 1.9118 7.2440 3.9055 5.9511 3.7498 21.2475 12.4397 48.9170 83.1477 10.8566 10.3678 16.8967 80.3310 0.2664 13.9832 14.6880 11.0545 236.0888 6.5607 26.8578 56.0839 40.6640 10.5835 44.9399 10.0613 13.0422 49.7520 173.5787 17.0270 5.0034 62.9289 5.8968 44.6591 3.1014 3.0018 0.5334 0.6627 52.3992
temp: 298.150 k
press: 1.00000 atm
elementType: 17 17 17 17 17 8 6 6 6 6 6 6 6 6 6 6 6 6 1 1 1 1 1
symmnumber: 1
zpe: 350258.8 jmol-1
zpe.correction: 0.133407 hartree
zpe.thermalcorrener: 0.150297 hartree
zpe.thermalcorrenthalpy: 0.151241 hartree
zpe.thermalcorrgfe: 0.086579 hartree
zpe.sumelectzpe: -2834.525720 hartree
zpe.sumelectthermal: -2834.508830 hartree
zpe.sumelectthermalent: -2834.507885 hartree
zpe.sumelectthermalfe: -2834.572548 hartree
dipole: -1.6411 0.2925 -1.9987
dipole: 2.6026
quadrupole: -162.7526 -126.2099 -136.7199
quadrupole: -4.5304 0.7454 2.4205
quadrupole: -20.8585 15.6842 5.1742 -4.5304 0.7454 2.4205
hfenergy: -2834.6591268 hartree
pointgroup: C01 [X(C12H5Cl5O1)]
dipole: -0.6447353 0.5393654 0.5846842 debye
dipolederiv: -0.171904 -0.0503559 0.1957443 -0.0803092 -0.0605318 0.1531206 0.1895363 0.1429001 -0.5077851 -0.2768732 0.2471675 -0.08377 0.3482557 -0.5055772 0.1569118 -0.1165041 0.1590984 -0.0878702 -0.3271049 0.1077593 -0.2738869 0.1418856 -0.0470436 0.1303192 -0.3620591 0.1306401 -0.3317578 -0.821265 -0.0455439 0.0226602 -0.0183609 -0.0028066 0.0014168 0.0240766 0.0045788 0.0014711 -0.8572424 -0.0338712 0.1511527 -0.0254085 -0.0277372 0.0215751 0.159541 0.0171645 -0.0813309 -0.3654831 -0.4833831 0.1659168 -0.6081603 -1.0704806 0.2219775 0.2156096 0.2291447 -0.4632184 0.2539346 0.0360243 0.0108 -0.1095623 0.2413397 -0.0418475 -0.0212385 -0.0845162 0.0032067 0.3952066 -0.0174058 0.0527791 0.0205395 -0.0419178 0.0583056 0.0696253 0.0795221 -0.1637855 -0.2762957 -0.3052321 0.0937543 0.0843594 -0.1799105 0.0128556 -0.0454297 -0.0072327 -0.1534099 -0.3729581 0.1539851 -0.0468205 0.0922737 -0.2662626 0.0522052 0.0515117 0.0626721 -0.1508102 0.0473644 0.098033 -0.3502408 0.097024 0.0098072 -0.2096641 -0.3689758 -0.1820311 0.6642197 -0.1074477 0.0220922 -0.0350671 0.0265154 -0.1166539 -0.0527193 0.0199128 -0.0447837 0.0305378 0.138596 0.4329687 -0.1495198 0.5814072 1.0252426 -0.2999546 -0.1761536 -0.3216157 0.2406579 0.3186528 -0.4607366 0.1523919 -0.430058 0.8105444 -0.2804518 0.0941752 -0.275261 0.0877702 0.1541891 -0.1981378 0.5476195 -0.2335402 0.0468048 -0.1526743 0.695908 -0.1675441 0.3497318 -0.2814017 -0.0127436 0.0544168 -0.0221911 -0.0721532 -0.0322674 -0.0622985 -0.0347218 -0.0000902 1.0602941 0.2523493 -0.1029281 -0.0926684 -0.3601685 0.0857978 0.0114479 0.0888008 -0.1265661 1.1060325 0.0900475 -0.3319937 0.0623404 -0.0452125 -0.0149634 -0.2988247 -0.0137395 0.006544 0.0726062 0.0473161 -0.0070299 0.0640232 -0.0171576 0.0519209 -0.0039801 0.0702144 0.1271623 0.0679554 -0.0553347 0.026468 -0.0720613 0.0443101 0.0297541 0.020267 0.0410202 0.1394462 0.036596 0.0258564 -0.0685637 0.0275687 0.1251063 0.048085 -0.0850178 0.0354286 0.02896 0.0488815 -0.0098933 0.0368857 -0.0101705 0.1459353 0.0523137 0.0418798 0.0536592 0.0200422 0.1576666 0.1590384 -0.0607688 0.1562978 0.3645232 0.0079837 -0.0530092 0.0166017 0.3668743 unknown
polarizability: 303.1733832|-8.6249515|135.3023719|-0.3432474|-44.304092|137.8549749 unknown
InChI: InChI=1S/C12H5Cl5O/c13-7-2-1-6(10(15)12(7)17)5-3-8(14)11(16)9(18)4-5/h1-4,18H
charge 0 multiplicity 1
23 atoms
Cl -1.106231 0.921785 -2.33899
Cl 3.662153 -2.552406 1.064205
Cl -4.272032 0.894265 -1.885933
Cl 5.251915 0.143303 0.079388
Cl -5.496172 -0.128843 0.9415
O  3.436624 2.347891 -0.660026
C  0.608911 0.043224 0.208573
C  -0.880774 0.012452 0.31277
C  1.301443 1.202696 -0.2156
C  1.351713 -1.097508 0.603454
C  -1.765224 0.417718 -0.724039
C  -1.465412 -0.44834 1.524003
C  2.712604 1.226668 -0.254087
C  2.759301 -1.065199 0.562099
C  -3.173074 0.382026 -0.555803
C  -2.858478 -0.495613 1.708519
C  3.457679 0.082588 0.137958
C  -3.709831 -0.073428 0.669989
H  0.741194 2.097706 -0.507238
H  0.842979 -2.014841 0.911406
H  -0.805127 -0.749321 2.342845
H  -3.286795 -0.844885 2.651457
H  2.831034 3.080361 -0.936146
