program: Gaussian 09
title: 000177890
version: EM64L-G09RevD.01
frameworkgroup: C1[X(C13H7Cl5O2S)]
method: RPBEPBE
basis: SDD
operation: Freq
keyword: #p
keyword: freq=noraman
keyword: PBEPBE/SDD
title: #p freq=noraman PBEPBE/SDD
converged: YES YES NO NO
title: Mulliken charges:
elementType: Cl Cl Cl Cl Cl S O O C C C C C C C C C C C C C H H H H H H H
charge: 0.043875 0.041720 0.011905 -0.025425 -0.028933 0.927574 -0.514251 -0.541875 -0.053643 0.527808 0.393270 -0.143036 -0.241944 -0.264413 -0.313774 -0.727390 -0.262251 -0.309608 -0.196283 -0.216754 -0.103446 0.338089 0.278638 0.298112 0.272585 0.258317 0.285557 0.265576
chargesum: 0.00000
title: Mulliken charges with hydrogens summed into heavy atoms:
elementType: Cl Cl Cl Cl Cl S O O C C C C C C C C C C C C C
charge: 0.043875 0.041720 0.011905 -0.025425 -0.028933 0.927574 -0.514251 -0.541875 -0.053643 0.527808 0.393270 -0.143036 0.096145 -0.264413 -0.313774 0.121944 -0.262251 -0.051291 0.089274 0.048822 -0.103446
polarizability: 3.28614778e+02 -4.14819229e+00 1.92697432e+02 1.46999316e+01 9.24521522e-01 1.60933169e+02
1716.lowfreq: -0.0026 -0.0022 0.0010 0.8431 3.9151 6.5444 15.2450 25.7723 33.2835
frequency: 15.2206 25.7605 33.2738 52.2662 62.5991 94.2889 114.1980 121.1797 128.6247 139.2803 153.1916 164.0394 166.0130 192.6606 199.1870 206.7452 221.0448 263.5991 274.7396 277.6896 311.0359 317.5257 333.3240 351.6850 373.5707 383.2471 413.8593 440.0703 458.2811 515.9209 524.0259 538.9027 553.6448 583.2078 601.2360 643.0029 657.8259 719.3702 735.0364 764.3798 772.8224 797.5569 812.9548 823.5782 868.1097 896.1236 922.6614 954.7567 976.6774 988.8823 1016.8757 1042.4594 1082.9102 1105.9889 1135.8955 1141.6182 1236.4730 1260.6324 1304.3387 1318.8189 1345.7519 1346.5035 1374.9895 1398.5039 1409.5547 1422.1444 1469.2066 1545.6614 1563.3037 1563.9183 1598.6439 3031.9319 3135.8173 3154.0142 3180.2823 3181.5772 3185.3874 3190.4158
redmass: 11.8510 11.6397 17.4261 8.4497 11.2431 19.1411 7.6305 6.6098 8.3785 10.9384 1.1011 11.0284 6.7358 14.5467 11.8921 9.6835 7.6425 5.7802 10.3316 10.1675 15.1324 13.3034 7.4653 7.7613 13.5621 10.7763 8.4552 3.6870 7.7917 7.7160 8.7669 5.1344 6.6614 7.5138 5.7234 9.8427 7.6553 5.5959 6.5007 9.9211 8.0677 12.4345 4.8439 1.6215 1.4217 3.1180 1.3556 1.3590 1.9135 2.7725 1.8660 4.0463 2.7429 5.4359 1.8748 1.3759 1.7974 1.9142 1.1538 5.9552 6.0945 7.1907 4.6291 3.2340 1.0566 1.0533 3.3191 10.4082 8.5032 9.3026 7.8499 1.0245 1.0921 1.0900 1.1072 1.0960 1.0942 1.1082
irintensity: 0.7599 1.2080 0.0801 3.3176 1.4956 0.7275 0.8367 4.9178 1.2696 0.2727 0.3985 0.5555 0.0051 0.6965 0.7451 1.0223 0.7192 1.6938 2.2473 1.7175 5.9606 9.3960 1.0948 10.3212 10.4413 96.8840 1.9012 4.4521 1.7122 3.6268 23.1766 2.2728 5.2158 33.6823 34.6728 19.3807 2.1006 6.3307 23.4300 48.8880 1.7948 54.7085 63.0756 28.9679 18.5515 27.3795 14.9234 0.1404 53.8583 24.9944 39.5145 51.3788 46.0796 43.5027 34.1583 3.6542 1.2737 3.1441 10.9619 131.9935 7.2612 11.2618 14.3128 85.8727 12.2754 15.2759 51.8835 7.9560 30.7736 13.0213 47.5476 0.3291 38.3586 2.3475 0.0849 0.3700 1.7738 0.6908
temp: 298.150 k
press: 1.00000 atm
elementType: 17 17 17 17 17 16 8 8 6 6 6 6 6 6 6 6 6 6 6 6 6 1 1 1 1 1 1 1
symmnumber: 1
zpe: 428756.5 jmol-1
zpe.correction: 0.163305 hartree
zpe.thermalcorrener: 0.184995 hartree
zpe.thermalcorrenthalpy: 0.185939 hartree
zpe.thermalcorrgfe: 0.109548 hartree
zpe.sumelectzpe: -3346.714145 hartree
zpe.sumelectthermal: -3346.692455 hartree
zpe.sumelectthermalent: -3346.691511 hartree
zpe.sumelectthermalfe: -3346.767902 hartree
dipole: -1.7406 -1.3763 2.4698
dipole: 3.3202
quadrupole: -175.1642 -172.2205 -158.5198
quadrupole: -8.1064 23.8544 -0.6935
quadrupole: -6.5294 -3.5856 10.1150 -8.1064 23.8544 -0.6935
hfenergy: -3346.87745 hartree
pointgroup: C01 [X(C13H7Cl5O2S1)]
dipole: -0.6966201 -0.4954095 0.9877255 debye
polarizability: 328.3669196|-6.9213883|192.9764478|14.789249|-0.3887864|160.9020118 unknown
InChI: InChI=1S/C13H7Cl5O2S/c1-21(19,20)10-5-9(16)11(13(18)12(10)17)7-3-2-6(14)4-8(7)15/h2-5H,1H3
charge 0 multiplicity 1
28 atoms
Cl 2.783428 -2.612589 0.050544
Cl -0.442937 -2.690844 -0.012067
Cl -0.562189 2.872906 -0.229619
Cl -1.817292 0.12032 2.633143
Cl -6.479904 -0.064861 -0.351294
S  4.39869 0.41184 -0.133819
O  5.041583 -0.503006 -1.314023
O  4.585508 2.037198 -0.137328
C  2.473777 0.172685 -0.069297
C  -0.349041 0.087467 -0.12531
C  -1.844058 0.043932 -0.167836
C  1.835826 -1.076881 -0.036512
C  1.762656 1.37801 -0.131665
C  0.420801 -1.106048 -0.064601
C  0.358757 1.315292 -0.157984
C  5.023599 -0.220903 1.558189
C  -2.630455 0.058317 1.007699
C  -2.520521 -0.004603 -1.412877
C  -4.037473 0.025795 0.975325
C  -3.928712 -0.038649 -1.484753
C  -4.664908 -0.022682 -0.284159
H  2.315585 2.324303 -0.167619
H  4.792833 -1.293012 1.60626
H  6.104558 -0.022383 1.541365
H  4.504862 0.371315 2.324165
H  -1.933836 -0.015541 -2.336966
H  -4.620398 0.038523 1.899113
H  -4.43904 -0.076101 -2.450575
