program: Gaussian 09
title: 000177889
version: EM64L-G09RevD.01
frameworkgroup: C1[X(C13H7Cl5O2S)]
method: RPBEPBE
basis: SDD
operation: Freq
keyword: #p
keyword: freq=noraman
keyword: PBEPBE/SDD
title: #p freq=noraman PBEPBE/SDD
converged: YES YES NO NO
title: Mulliken charges:
elementType: Cl Cl Cl Cl Cl S O O C C C C C C C C C C C C C H H H H H H H
charge: 0.028196 0.051454 0.028412 -0.027108 -0.027741 0.920547 -0.517290 -0.544166 -0.046085 0.555718 -0.340319 0.375592 -0.240127 -0.312217 -0.092733 -0.726890 -0.260757 -0.305136 -0.197106 -0.217150 -0.103988 0.338973 0.278780 0.297405 0.271999 0.259698 0.285752 0.266288
chargesum: 0.00000
title: Mulliken charges with hydrogens summed into heavy atoms:
elementType: Cl Cl Cl Cl Cl S O O C C C C C C C C C C C C C
charge: 0.028196 0.051454 0.028412 -0.027108 -0.027741 0.920547 -0.517290 -0.544166 -0.046085 0.555718 -0.340319 0.375592 0.098846 -0.312217 -0.092733 0.121294 -0.260757 -0.045438 0.088646 0.049138 -0.103988
polarizability: 2.96187145e+02 8.47102246e+00 2.21342034e+02 1.42364547e+01 1.12275374e+00 1.59940532e+02
1716.lowfreq: -3.1824 -0.0024 -0.0018 -0.0006 2.4096 2.8106 13.7583 31.0648 32.3291
frequency: 13.7286 31.0398 32.3277 51.3039 55.9988 94.2354 105.4137 117.2610 129.1704 141.3583 152.7226 165.6901 169.7936 190.6138 197.7066 205.8887 215.8069 253.4361 275.4813 291.4813 312.7364 313.1727 336.5896 368.6294 369.6848 378.2721 418.2175 431.2243 440.2309 514.0307 522.0057 545.6514 573.1912 595.5317 608.0583 620.8943 652.6057 714.2949 730.8875 778.6408 783.1629 798.7089 810.2176 824.0472 868.9334 895.7531 928.5293 956.0837 977.5709 992.3384 1016.2615 1040.8857 1082.5058 1104.8802 1141.6246 1146.3013 1220.5657 1252.2963 1304.9074 1338.0346 1345.7942 1363.1348 1371.8554 1385.3637 1409.2871 1421.3090 1468.4089 1538.7668 1562.7710 1568.3520 1597.1428 3031.5704 3130.7934 3154.0897 3179.9858 3182.4425 3185.4267 3189.7732
redmass: 11.6947 12.3964 17.4602 6.6641 18.0813 18.3445 8.0116 4.7376 8.7391 1.1501 14.8009 6.6436 8.0219 18.7231 8.3480 14.1471 10.5246 5.9438 10.7067 7.5947 21.1773 10.5052 7.3881 9.3575 10.2109 9.9731 6.3612 10.4057 3.5099 8.1557 7.9580 7.1210 6.7549 5.7819 6.0816 10.3673 7.5584 7.9856 4.7454 8.7304 9.3801 11.5007 8.1963 1.4353 1.4171 3.1785 1.3642 1.3568 1.5809 4.0680 1.8558 4.1307 2.7313 5.4515 1.4138 1.5748 3.6985 1.4618 1.1369 8.0002 4.6516 3.9021 4.7026 4.6875 1.0543 1.0536 3.3333 8.1816 8.3847 10.7193 7.8119 1.0245 1.0919 1.0901 1.1071 1.0957 1.0945 1.1083
irintensity: 0.5389 2.1203 0.1272 3.1287 1.0271 0.5120 0.3304 3.9382 2.3535 0.9123 0.3512 0.0357 0.7357 0.9257 0.8329 1.0924 0.8834 0.7792 0.6832 1.0385 0.7267 15.9304 1.9933 9.5493 7.7039 80.2873 8.8079 17.4302 7.4069 4.2189 9.5471 11.5824 13.0810 9.6610 27.9160 15.4917 2.7362 39.5979 8.7866 10.1786 31.8529 69.7438 66.0976 22.1918 18.3951 26.7058 15.5595 0.2034 52.5335 38.5458 38.9684 48.1952 47.0230 54.9616 7.1694 7.4451 29.4176 6.7558 6.5405 45.1249 8.9091 50.1898 56.4496 70.6252 9.6290 13.7536 52.6897 14.4249 27.4908 15.2852 49.1232 0.3049 40.4634 2.0378 0.0608 0.2452 1.7311 0.6598
temp: 298.150 k
press: 1.00000 atm
elementType: 17 17 17 17 17 16 8 8 6 6 6 6 6 6 6 6 6 6 6 6 6 1 1 1 1 1 1 1
symmnumber: 1
zpe: 428770.8 jmol-1
zpe.correction: 0.163310 hartree
zpe.thermalcorrener: 0.185023 hartree
zpe.thermalcorrenthalpy: 0.185967 hartree
zpe.thermalcorrgfe: 0.109391 hartree
zpe.sumelectzpe: -3346.714666 hartree
zpe.sumelectthermal: -3346.692953 hartree
zpe.sumelectthermalent: -3346.692009 hartree
zpe.sumelectthermalfe: -3346.768585 hartree
dipole: -2.5892 -0.3164 2.4120
dipole: 3.5527
quadrupole: -183.1846 -166.2917 -159.0170
quadrupole: 0.3261 17.1183 -11.3380
quadrupole: -13.6868 3.2061 10.4807 0.3261 17.1183 -11.3380
hfenergy: -3346.8779761 hartree
pointgroup: C01 [X(C13H7Cl5O2S1)]
dipole: 1.009653 -0.1239736 -0.9586101 debye
polarizability: 295.9932905|-10.2875025|221.7467072|13.0882989|0.0276018|159.7297134 unknown
InChI: InChI=1S/C13H7Cl5O2S/c1-21(19,20)10-5-9(16)12(17)11(13(10)18)7-3-2-6(14)4-8(7)15/h2-5H,1H3
charge 0 multiplicity 1
28 atoms
Cl -0.404919 -2.267151 0.045321
Cl 0.983385 3.111754 0.175259
Cl -2.165585 3.91614 0.14317
Cl 1.54689 0.143427 -2.645296
Cl 6.061922 -1.080768 0.321403
S  -3.723424 -1.39404 0.136945
O  -3.514124 -2.455423 1.351209
O  -5.043265 -0.427447 0.085665
C  -2.243567 -0.150879 0.075029
C  0.126694 0.468232 0.123023
C  -0.890942 -0.520723 0.090556
C  1.575045 0.092541 0.156744
C  -2.641692 1.192678 0.093803
C  -0.282242 1.82983 0.139939
C  -1.650047 2.188753 0.12355
C  -3.650335 -2.328321 -1.528816
C  2.335557 -0.087167 -1.022307
C  2.230259 -0.100775 1.399252
C  3.697594 -0.441862 -0.995819
C  3.593211 -0.45717 1.465401
C  4.305546 -0.621713 0.261449
H  -3.712373 1.432439 0.095827
H  -2.70981 -2.894145 -1.540162
H  -4.535216 -2.980225 -1.514826
H  -3.70903 -1.565898 -2.317362
H  1.66192 0.029692 2.325611
H  4.261587 -0.572298 -1.922168
H  4.087062 -0.60348 2.429402
