program: Gaussian 09
title: 000177934
version: EM64L-G09RevD.01
frameworkgroup: C1[X(C22H31N3O3)]
method: RPBEPBE
basis: SDD
operation: Freq
keyword: #p
keyword: freq=noraman
keyword: PBEPBE/SDD
title: #p freq=noraman PBEPBE/SDD
converged: YES YES NO NO
title: Mulliken charges:
elementType: O O O N N N C C C C C C C C C C C C C C C C C C C C C C H H H H H H H H H H H H H H H H H H H H H H H H H H H H H H H
charge: -0.258610 -0.240288 -0.208274 -0.105199 -0.300542 -0.584197 0.154325 0.153894 -0.481464 0.006184 -0.453821 -0.344789 -0.338286 0.184287 0.233141 0.315765 -0.651952 0.034599 -0.309726 -0.391653 0.351296 -0.800396 -0.641043 -0.782713 -0.388135 -0.485362 -0.812232 0.116883 0.231891 0.201541 0.194808 0.220287 0.184606 0.214788 0.208524 0.204528 0.248717 0.255846 0.234615 0.179499 0.189817 0.189822 0.238781 0.238956 0.285187 0.226081 0.190741 0.222772 0.248262 0.242907 0.248695 0.188895 0.228188 0.252151 0.241037 0.241443 0.240405 0.276147 0.258373
chargesum: 0.00000
title: Mulliken charges with hydrogens summed into heavy atoms:
elementType: O O O N N N C C C C C C C C C C C C C C C C C C C C C C
charge: -0.258610 -0.240288 -0.208274 -0.105199 -0.051826 -0.049678 0.154325 0.153894 -0.048032 0.006184 -0.038726 0.054604 0.074765 0.184287 0.233141 0.315765 -0.396106 0.034599 0.104389 -0.012014 0.351296 -0.037471 -0.001449 -0.042849 0.028947 -0.233212 -0.089348 0.116883
polarizability: 3.80937065e+02 4.37686354e+01 3.18974781e+02 -1.70350973e+01 -8.17392796e+00 1.78336634e+02
1716.lowfreq: -7.4674 -2.8834 -0.0010 -0.0005 0.0004 2.5985 6.1529 9.7733 17.2961
frequency: 3.0398 9.3029 17.2352 28.5629 40.9962 55.4073 61.8096 64.4409 73.5030 79.8210 94.6619 114.6588 126.9865 143.6622 146.6214 148.1643 166.9647 170.9596 178.0683 197.6066 207.7049 209.2895 219.7532 220.5655 222.4020 240.1701 274.4380 286.8617 292.9463 305.0903 331.2683 356.2354 356.8976 372.7250 378.2487 387.8261 407.4751 426.5369 439.4461 465.3271 489.2965 518.1947 535.8428 546.3336 568.6065 569.3933 575.7237 611.3766 620.7675 653.2986 661.5458 697.4031 703.5920 724.3254 730.2532 759.4490 766.1674 770.9522 793.6864 800.0938 822.1166 864.1596 866.1790 883.0758 884.9134 891.5633 934.2453 937.0715 958.7056 960.3995 978.1557 985.7409 1012.5824 1020.0778 1033.8249 1043.0600 1046.7925 1049.2453 1069.3397 1071.0805 1078.8088 1090.6231 1099.0293 1104.8213 1117.8805 1118.5334 1126.6856 1135.5652 1144.9915 1157.7871 1174.3248 1180.9366 1214.1188 1218.9522 1226.7139 1234.1944 1258.3883 1259.0087 1266.0037 1275.9522 1282.1701 1300.3304 1306.7692 1323.8556 1343.2360 1351.1470 1353.9885 1369.4914 1375.5089 1385.4805 1392.2782 1394.7356 1401.0801 1403.9586 1412.0163 1428.5579 1434.0802 1442.1803 1455.9264 1456.7809 1458.3121 1463.9758 1464.7356 1465.4295 1466.4061 1470.9321 1472.9348 1474.8477 1477.1883 1479.8514 1482.1002 1483.7288 1488.3737 1497.4241 1588.3194 1606.1214 1630.1913 1634.5882 1637.6469 1680.1503 2830.7361 2847.5585 2851.6121 2862.9181 2888.1300 2900.9538 2972.4995 2975.3394 2975.4798 2976.2315 2981.0505 2994.1971 2996.5519 3018.1226 3022.6789 3030.0221 3039.2256 3042.7934 3048.0912 3054.5533 3057.9112 3073.7581 3083.2977 3100.1012 3101.6721 3114.7897 3156.8604 3170.4071 3416.2190 3452.3804 3579.9399
redmass: 3.7577 4.9370 4.3144 4.5873 3.3186 2.8438 1.5610 2.2736 2.8682 3.0147 2.9264 2.2251 3.2585 3.3807 2.7602 3.5226 1.3907 1.4040 1.3681 4.1110 3.5475 1.6053 2.3738 2.0032 2.9033 1.2539 3.5168 3.5263 2.1360 3.2952 4.8947 3.8271 3.2549 2.5330 4.7190 2.3956 4.3324 3.3148 2.6499 5.9853 3.5595 2.4986 4.1209 3.9517 4.2979 4.5629 5.1135 4.6243 1.2900 4.3632 4.6846 5.0060 1.3954 5.6730 2.1421 5.2728 4.0943 7.0859 1.4330 6.2783 1.8233 1.4544 2.6662 1.7234 1.7905 2.4520 2.3131 1.5392 3.1333 2.0837 1.9994 1.6115 1.6265 2.3567 1.9063 1.4893 1.5753 1.4739 2.0064 2.2255 2.0345 2.7262 3.0555 1.7442 2.1554 3.9076 4.3621 1.7503 2.7021 1.4260 3.1484 1.5157 3.8107 1.8444 1.9001 1.3026 1.5926 2.4621 1.3759 1.2937 1.2297 1.2347 1.3393 1.6077 1.3419 1.4650 1.6368 1.3732 1.8861 1.3363 1.8439 1.2797 1.4696 1.8837 3.0938 1.1694 2.8027 1.2076 1.1324 1.0877 1.0859 1.0483 1.1245 2.9734 1.0966 1.0943 1.0782 1.0664 1.3382 1.0832 1.0857 1.0952 1.0686 1.0817 8.4638 7.7342 8.3327 7.5620 1.0947 10.2462 1.0708 1.0608 1.0720 1.0676 1.0710 1.0682 1.0850 1.0412 1.0602 1.0638 1.0380 1.0864 1.0371 1.0877 1.0935 1.0720 1.0906 1.0984 1.0917 1.0973 1.0969 1.0970 1.0997 1.0993 1.0985 1.1003 1.0914 1.0919 1.0742 1.0450 1.0973
irintensity: 0.1591 0.6030 0.2764 1.5880 0.1151 0.7894 0.0153 0.0526 0.1378 2.2082 2.7290 4.4272 2.1424 1.2229 8.9653 3.3819 0.3224 0.1290 0.6166 1.9343 1.1222 1.7731 4.9648 6.8840 1.8658 31.8129 0.3571 0.1377 2.6461 1.9844 1.0828 3.6269 5.6800 2.6748 1.8796 3.4629 4.2483 8.1139 0.9479 5.2401 1.9663 11.1995 9.9841 8.9571 1.7000 3.2827 7.2954 2.2595 180.5508 21.6101 1.7073 4.3219 77.0426 6.7513 15.6469 0.7001 5.4016 14.6423 3.2410 9.3578 1.6600 2.0846 1.3731 49.4471 41.5774 39.2558 6.0756 13.6700 25.8247 18.1501 0.3935 6.8881 25.5726 11.1159 32.5661 0.9756 9.4758 7.1715 44.3812 128.0286 11.9819 13.9660 15.3725 11.4046 19.1845 97.2155 33.2771 14.7534 7.7388 10.6623 11.9125 28.9568 6.9409 9.2944 7.6488 9.1425 7.6524 26.6952 7.4503 6.4409 3.6279 2.5846 9.5119 13.7622 15.4477 6.7062 20.0718 8.5538 50.3491 3.6503 8.1102 17.4668 53.8313 45.0248 9.5303 5.4175 12.6552 44.1146 5.1705 14.5544 3.0691 14.3484 0.7691 42.0867 15.9076 21.4247 12.4266 11.1963 36.4536 7.3355 13.2059 13.9195 9.6277 5.7774 73.8902 20.5598 5.6085 53.0019 44.8553 661.1568 78.1945 64.6776 77.4627 257.8025 109.5766 79.5539 26.1691 12.9994 84.2281 23.1460 13.5133 31.2995 14.5416 16.4859 11.3615 35.0414 42.7195 44.4853 72.3488 12.9538 13.1024 10.6215 38.4992 0.9535 23.9120 7.4547 5.8494 2.8745 0.6452 1.8428 0.3856
temp: 298.150 k
press: 1.00000 atm
elementType: 8 8 8 7 7 7 6 6 6 6 6 6 6 6 6 6 6 6 6 6 6 6 6 6 6 6 6 6 1 1 1 1 1 1 1 1 1 1 1 1 1 1 1 1 1 1 1 1 1 1 1 1 1 1 1 1 1 1 1
symmnumber: 1
zpe: 1297161.9 jmol-1
zpe.correction: 0.494063 hartree
zpe.thermalcorrener: 0.524269 hartree
zpe.thermalcorrenthalpy: 0.525213 hartree
zpe.thermalcorrgfe: 0.427584 hartree
zpe.sumelectzpe: -1244.721555 hartree
zpe.sumelectthermal: -1244.691349 hartree
zpe.sumelectthermalent: -1244.690405 hartree
zpe.sumelectthermalfe: -1244.788034 hartree
dipole: 8.6522 -1.1983 -0.6805
dipole: 8.7612
quadrupole: -222.2021 -154.7154 -163.1794
quadrupole: -13.6870 3.2476 4.1451
quadrupole: -42.1698 25.3169 16.8529 -13.6870 3.2476 4.1451
hfenergy: -1245.2156179 hartree
pointgroup: C01 [X(C22H31N3O3)]
dipole: -3.4244122 -0.2974363 0.2573742 debye
polarizability: 378.4470305|-47.5274265|317.7651256|-0.573235|-26.0277971|182.036323 unknown
InChI: InChI=1S/C22H31N3O3/c1-14-11-20(26)28-21-15(2)22-18(12-17(14)21)19(16(3)27-22)13-24-8-6-10-25(4)9-5-7-23/h11-12,24H,5-10,13,23H2,1-4H3
charge 0 multiplicity 1
59 atoms
O  2.324512 2.766855 -0.232439
O  5.724422 -0.694038 0.096062
O  7.341743 -2.329372 0.246902
N  -5.976542 -0.181293 -1.029062
N  -1.884973 1.477549 -0.472054
N  -7.038567 -1.161612 2.504087
C  0.5034 1.400342 0.222383
C  1.715419 0.584918 0.259845
C  -0.902542 0.906295 0.480188
C  2.807896 1.463411 -0.024776
C  -4.227021 1.642348 -1.290618
C  -5.709579 1.279776 -1.055277
C  -3.279785 1.024709 -0.246129
C  0.898985 2.696029 -0.0681
C  4.155725 1.086543 -0.090259
C  3.331735 -1.231623 0.449863
C  1.985303 -0.774565 0.499666
C  4.380836 -0.292912 0.156479
C  -7.316062 -0.505226 -0.467141
C  -7.374576 -1.916592 0.15495
C  3.707068 -2.626033 0.685192
C  0.172959 3.988339 -0.224831
C  -5.74765 -0.820168 -2.340812
C  5.280068 2.048338 -0.394159
C  -6.502649 -2.022476 1.425609
C  5.036667 -2.99673 0.619578
C  2.64081 -3.653625 0.997295
C  6.123545 -2.071762 0.324202
H  -1.229149 1.193642 1.501016
H  -0.894773 -0.213207 0.468457
H  -3.910011 1.335724 -2.308917
H  -4.128101 2.744636 -1.254926
H  -6.329654 1.797364 -1.834343
H  -6.019835 1.68725 -0.074243
H  -3.387461 -0.085859 -0.263532
H  -3.588243 1.354909 0.766509
H  -1.588007 1.309564 -1.445086
H  1.177216 -1.476593 0.723937
H  -7.529853 0.211569 0.346599
H  -8.119389 -0.395021 -1.239302
H  -7.047019 -2.684361 -0.573663
H  -8.429644 -2.1526 0.406848
H  0.424285 4.471903 -1.186989
H  0.440768 4.699064 0.579768
H  -0.910033 3.786427 -0.197698
H  -4.695588 -0.700525 -2.653586
H  -6.398821 -0.395638 -3.148055
H  -5.950958 -1.902522 -2.274235
H  5.831277 1.735018 -1.298692
H  4.891878 3.067445 -0.546462
H  6.016587 2.063069 0.428789
H  -6.411624 -3.09643 1.71665
H  -5.490498 -1.65888 1.167882
H  5.345229 -4.031671 0.790909
H  1.906187 -3.727438 0.173486
H  2.079675 -3.381164 1.91092
H  3.083915 -4.650551 1.151639
H  -6.36981 -0.950493 3.250461
H  -7.937591 -1.481754 2.879917
