program: Gaussian 09
title: 000177856
version: EM64L-G09RevD.01
frameworkgroup: C1[X(C8H14N3O4P)]
method: RPBEPBE
basis: SDD
operation: Freq
keyword: #p
keyword: freq=noraman
keyword: PBEPBE/SDD
title: #p freq=noraman PBEPBE/SDD
converged: NO YES NO NO
title: Mulliken charges:
elementType: P O O O O N N N C C C C C C C C H H H H H H H H H H H H H H
charge: 1.228698 -0.483954 -0.670393 -0.669637 -0.627449 -0.422294 -0.157004 -0.010815 -0.560546 0.296240 -0.457461 -0.377894 -0.461549 -0.407795 0.159732 -0.324144 0.350223 0.268215 0.221636 0.245643 0.219409 0.180187 0.238916 0.208333 0.245862 0.374333 0.342063 0.388930 0.388757 0.273758
chargesum: 0.00000
title: Mulliken charges with hydrogens summed into heavy atoms:
elementType: P O O O O N N N C C C C C C C C
charge: 1.228698 -0.109621 -0.281463 -0.280880 -0.627449 -0.080231 -0.157004 -0.010815 -0.210323 0.296240 0.032389 0.087158 -0.042445 0.046400 0.159732 -0.050386
polarizability: 1.65591264e+02 1.31789461e+01 1.22188820e+02 3.71744705e+00 -4.37145165e-01 1.19856955e+02
1716.lowfreq: -11.6801 -0.0017 -0.0014 -0.0011 2.4982 11.4100 25.1216 25.6080 54.8361
frequency: 24.5874 25.5761 54.8092 82.1148 100.0990 121.3704 153.3542 171.9608 193.9281 224.2689 255.9692 281.7709 288.9917 308.4133 334.1075 350.5941 357.6628 366.6545 397.3164 430.3905 454.9999 469.2522 483.0991 509.9202 651.4877 653.5410 693.5786 700.5021 726.5807 736.5376 746.6109 844.6759 852.6360 860.5381 862.2101 903.0064 928.4847 930.3702 960.6725 965.2427 978.6525 983.5201 1025.8008 1050.1467 1061.7945 1077.8804 1081.5620 1117.6059 1131.3785 1170.2801 1178.8645 1208.1592 1229.9604 1234.2433 1256.8605 1266.8190 1287.9046 1298.0478 1316.9809 1330.9022 1342.3238 1349.4619 1350.6949 1378.5105 1408.4046 1443.0289 1456.2328 1465.9418 1478.4128 1504.8373 2966.8744 2980.9193 2985.1078 3004.6257 3043.4663 3056.4537 3059.6343 3070.2277 3074.0964 3261.2173 3399.6441 3591.9737 3595.2091 3612.0863
redmass: 8.7946 4.9974 7.6634 4.7778 3.6030 4.7045 2.7409 3.4068 3.6380 4.7871 3.0192 3.6693 3.2801 4.5794 2.3488 2.6610 2.8448 1.7743 4.0107 1.7028 2.5235 1.8257 3.5332 2.1231 5.3924 8.3742 1.1871 4.2614 8.0127 3.8990 3.7252 2.3505 2.5274 1.7272 1.3597 2.3886 5.7056 2.8746 2.7131 2.4427 2.0607 1.1973 2.8549 5.2552 1.7345 1.6220 2.6431 2.8277 2.4352 2.1661 2.3670 1.4718 2.8221 1.4644 1.3990 1.6865 1.2194 1.2727 1.5304 1.5004 1.8118 1.4192 1.4757 1.8908 2.4900 1.0944 1.0985 1.0842 1.0903 3.5039 1.0650 1.0643 1.0634 1.0616 1.0841 1.0960 1.0977 1.1008 1.1007 1.0992 1.0658 1.0659 1.0663 1.0832
irintensity: 0.4969 0.4775 1.3940 1.6044 1.3459 2.8819 3.3585 3.3552 15.4929 11.5153 7.4083 19.3382 10.5222 14.8012 76.4740 45.5800 112.8960 85.7704 23.1417 56.3332 1.6607 26.9936 11.5418 6.6487 6.6870 93.0710 85.1191 84.0406 167.9700 83.0394 46.5589 4.3725 8.6311 4.2415 24.7848 4.6060 7.3368 20.5112 68.8486 14.3238 3.7114 35.3313 15.7090 10.3078 10.3183 1.1661 169.6086 1.0382 3.8028 14.1104 7.4901 25.9743 9.7283 13.9517 13.3055 4.9498 12.0658 16.0633 32.1377 6.6497 5.9684 8.3870 9.1278 96.7236 29.9966 5.7488 7.5598 14.1689 14.3931 27.5519 23.1815 13.7253 26.6926 32.1790 2.4426 29.6872 22.5201 6.0422 24.3155 1.4294 102.2214 54.8308 44.3520 56.2243
temp: 298.150 k
press: 1.00000 atm
elementType: 15 8 8 8 8 7 7 7 6 6 6 6 6 6 6 6 1 1 1 1 1 1 1 1 1 1 1 1 1 1
symmnumber: 1
zpe: 607850.3 jmol-1
zpe.correction: 0.231518 hartree
zpe.thermalcorrener: 0.248019 hartree
zpe.thermalcorrenthalpy: 0.248963 hartree
zpe.thermalcorrgfe: 0.186217 hartree
zpe.sumelectzpe: -1118.377808 hartree
zpe.sumelectthermal: -1118.361306 hartree
zpe.sumelectthermalent: -1118.360362 hartree
zpe.sumelectthermalfe: -1118.423109 hartree
dipole: 0.2782 0.7212 1.2661
dipole: 1.4835
quadrupole: -99.9720 -97.8977 -110.6154
quadrupole: -3.1153 -3.5275 8.1071
quadrupole: 2.8563 4.9307 -7.7870 -3.1153 -3.5275 8.1071
hfenergy: -1118.6093255 hartree
pointgroup: C01 [X(C8H14N3O4P1)]
dipole: -0.1192121 -0.2368351 0.5199376 debye
polarizability: 166.6289591|10.8536942|121.1902651|-4.8514102|0.4344926|119.8178155 unknown
InChI: InChI=1S/C8H14N3O4P/c12-8(7-9-5-10-11-7)3-1-2-6(4-8)16(13,14)15/h5-6,11-14H,1-4H2
charge 0 multiplicity 1
30 atoms
P  -3.12952 0.911648 0.035132
O  0.718532 -1.032484 -1.657426
O  -4.478526 -0.010791 -0.553374
O  -2.803137 2.102157 -1.186866
O  -3.376058 1.542812 1.482418
N  2.682052 0.5584 1.108574
N  2.960287 0.369905 -1.087847
N  3.928513 1.152759 0.864446
C  -1.731506 -0.286448 -0.250953
C  0.782422 -0.589559 -0.256772
C  -0.380252 0.418351 -0.003578
C  -1.91281 -1.544816 0.63315
C  0.628862 -1.844094 0.646233
C  -0.736286 -2.521949 0.402429
C  2.117513 0.096319 -0.058403
C  4.038513 1.00645 -0.48466
H  -1.790346 -0.567068 -1.318616
H  -0.264458 1.275653 -0.68946
H  -0.334249 0.798823 1.037125
H  -2.869878 -2.039371 0.388996
H  -1.955852 -1.247283 1.700926
H  0.715906 -1.546592 1.71247
H  1.453253 -2.543564 0.420114
H  -0.843509 -3.396075 1.071283
H  -0.760838 -2.893659 -0.638131
H  1.499056 -0.622414 -2.130963
H  2.334209 0.52365 2.064738
H  -5.349782 0.26236 -0.168431
H  -3.199164 2.9908 -0.999332
H  4.909052 1.36518 -1.025922
