program: Gaussian 09
title: 000177816
version: EM64L-G09RevD.01
frameworkgroup: C1[X(C8H11F3O2)]
method: RPBEPBE
basis: SDD
operation: Freq
keyword: #p
keyword: freq=noraman
keyword: PBEPBE/SDD
title: #p freq=noraman PBEPBE/SDD
converged: YES YES NO NO
title: Mulliken charges:
elementType: F F F O O C C C C C C C C H H H H H H H H H H H
charge: -0.177116 -0.155121 -0.158451 -0.270349 -0.214348 0.040703 -0.707729 -0.694254 0.242131 0.174374 -0.222732 0.251161 -0.672049 0.232734 0.234677 0.241797 0.219342 0.247817 0.244171 0.235463 0.230609 0.216378 0.229056 0.231735
chargesum: 0.00000
title: Mulliken charges with hydrogens summed into heavy atoms:
elementType: F F F O O C C C C C C C C
charge: -0.177116 -0.155121 -0.158451 -0.270349 -0.214348 0.040703 0.001479 0.017076 0.242131 0.174374 0.243341 0.251161 0.005120
polarizability: 1.20788122e+02 5.16276317e-01 8.30831795e+01 6.86060657e+00 9.81041921e-01 8.05939320e+01
1716.lowfreq: -5.0115 -0.0009 -0.0009 -0.0001 9.3316 12.5541 21.6625 37.6145 61.4207
frequency: 20.8513 37.2609 61.3547 79.0699 113.8609 137.0192 177.7377 183.8844 227.3628 242.7241 256.3090 276.0585 282.1266 288.9879 313.9724 332.9376 364.7279 395.4447 417.0321 494.1332 517.7641 566.7949 619.3040 690.3104 715.1934 795.9688 800.0459 859.6897 923.7634 950.8031 1001.3661 1020.3281 1022.4175 1087.4488 1110.9505 1116.7632 1135.3391 1145.2313 1173.3562 1210.3474 1249.3849 1273.8317 1354.3854 1381.5523 1400.3994 1405.3909 1462.8143 1464.5491 1471.4393 1474.2994 1482.1353 1486.3304 1495.7643 1627.0569 1759.6914 2996.7862 3002.7042 3003.8265 3013.9987 3073.2799 3093.3989 3101.8012 3106.5649 3109.2204 3112.9345 3124.7609
redmass: 5.3680 6.2675 3.3918 7.3707 2.2504 4.8298 6.4933 6.3309 1.3516 1.3705 2.2836 1.7964 1.9071 2.5167 3.9181 2.8157 4.6523 5.1740 7.2465 10.0544 6.6825 7.4973 6.2215 4.5673 6.5561 4.3427 1.1114 3.9768 2.7316 1.4835 2.9159 2.1048 1.4971 4.2649 2.8487 3.1340 1.4841 5.6524 6.1918 3.0335 1.1358 4.0252 1.3593 1.1696 1.2390 1.2142 1.0478 1.0404 1.0509 1.0589 1.0528 1.0697 1.0613 11.5987 11.9795 1.0359 1.0350 1.0356 1.0583 1.1066 1.0985 1.0999 1.1005 1.1030 1.1016 1.1008
irintensity: 0.1749 0.1695 0.3770 0.1303 2.5630 1.1117 2.8372 1.2071 0.8457 0.4099 2.0404 1.0222 1.5574 3.8640 5.7668 3.7519 5.8346 1.3436 5.3078 4.8348 1.8587 8.7661 4.4291 3.0321 2.0095 7.5620 3.8232 23.4678 19.6482 2.2249 188.2940 22.0778 81.0659 120.0938 66.4874 163.9869 11.7602 75.1693 76.5781 82.0620 0.0897 3.8549 2.0139 15.4579 21.7138 14.6149 11.5485 9.4601 2.8745 4.8079 12.8007 17.7583 32.0031 170.7785 71.1990 18.4348 13.1121 18.1151 16.4569 4.8469 28.0767 10.3130 26.6826 42.8419 12.3113 13.9381
temp: 298.150 k
press: 1.00000 atm
elementType: 9 9 9 8 8 6 6 6 6 6 6 6 6 1 1 1 1 1 1 1 1 1 1 1
symmnumber: 1
zpe: 470696.7 jmol-1
zpe.correction: 0.179279 hartree
zpe.thermalcorrener: 0.194235 hartree
zpe.thermalcorrenthalpy: 0.195179 hartree
zpe.thermalcorrgfe: 0.136100 hartree
zpe.sumelectzpe: -760.362579 hartree
zpe.sumelectthermal: -760.347623 hartree
zpe.sumelectthermalent: -760.346679 hartree
zpe.sumelectthermalfe: -760.405758 hartree
dipole: 3.8997 2.7248 0.8777
dipole: 4.8376
quadrupole: -70.2208 -77.5726 -76.1398
quadrupole: -4.2564 -2.7018 -0.3180
quadrupole: 4.4236 -2.9282 -1.4954 -4.2564 -2.7018 -0.3180
hfenergy: -760.5418577 hartree
pointgroup: C01 [X(C8H11F3O2)]
dipole: 1.5248883 -1.0575113 -0.4228623 debye
dipolederiv: -0.2957843 0.0727286 0.0258579 -0.0630607 -0.5964164 0.3132475 0.1040495 0.2459074 -0.3084939 -0.9053637 0.3152105 0.1475211 0.4844369 -0.4063095 0.0207695 0.0731704 0.0747142 -0.12622 -0.371549 -0.0623896 0.1506187 -0.1939023 -0.5708127 0.3594062 0.238707 0.3124913 -0.3595175 -1.7507672 0.0299618 0.0486916 0.0257256 -0.384093 -0.1394597 -0.0083371 -0.1289774 -0.3923391 -0.7097712 -0.0508382 -0.0534832 0.1936071 -0.5768299 -0.298961 0.1909929 -0.3235161 -0.5746142 0.111392 -0.0265212 -0.0700777 -0.2078614 -0.0907384 -0.0172859 0.0245061 -0.0413755 0.0477148 -0.0348001 -0.0102518 -0.0216137 0.0201528 0.0340704 0.0376579 -0.044523 -0.020299 0.0011193 -0.088802 0.024148 0.0478428 0.0610658 0.0196996 -0.0136265 0.0045442 0.0287054 0.0101645 1.6752232 0.0585451 0.002295 -0.2163062 0.6458524 0.4908417 -0.2591787 0.5074718 0.6021577 0.2417267 -0.10433 -0.0215494 0.0357223 0.5020363 -0.3478957 -0.0535148 -0.2673143 0.1381111 0.8962021 0.0741166 0.0796163 0.1886109 0.3109102 -0.0268091 0.2127372 -0.028538 0.3067378 1.2607357 -0.2802664 -0.2965063 -0.2280243 0.9482497 -0.4027475 -0.3842773 -0.3807362 0.4849442 -0.1445257 0.0353986 0.0377686 0.0218446 0.0431213 -0.0183992 0.020406 -0.0198193 0.0411571 -0.0150644 -0.1055943 -0.0726192 -0.0982706 0.0101884 -0.0344484 -0.0737852 -0.0365347 0.0424617 -0.0569054 0.1142727 0.0200124 0.0878627 0.0480768 0.0118342 0.0330484 -0.0157285 0.0951603 0.1079219 -0.0165 0.0482994 0.0118138 0.0719907 -0.0244978 0.0345924 0.0095188 -0.0981654 -0.0294598 -0.1088532 -0.09464 -0.1106795 0.0288098 -0.0750043 -0.0713015 -0.0486055 0.0212048 -0.044519 0.0968262 0.0436427 0.1060362 0.0575152 -0.0079331 0.0485605 0.0070757 0.0792759 0.1195776 -0.0154191 0.0146471 -0.0270715 -0.0528999 0.1059499 0.0081004 0.0585584 0.0302796 -0.0373023 0.0445302 -0.0154456 -0.0420119 -0.1139115 0.0080274 -0.0533939 0.0304726 0.0619399 -0.0418922 -0.0186368 0.046297 -0.0486377 0.0581322 0.040411 -0.0436671 0.0173581 -0.1191271 -0.1008729 -0.0650452 -0.0713363 -0.0786448 0.0646658 -0.05688 -0.0883862 -0.0567313 0.0556823 0.1063921 -0.0134746 0.0122085 0.0483218 -0.1355914 0.028222 0.033139 0.0364096 0.0883308 0.1082078 0.012382 -0.0080478 0.0292702 0.0842839 0.0475808 0.0538108 0.0394924 -0.1279647 unknown
polarizability: 120.7435193|-0.3314478|82.9396197|-6.991144|1.196688|80.7820942 unknown
InChI: InChI=1S/C8H11F3O2/c1-4-13-7(12)8(2,3)5(9)6(10)11/h4H2,1-3H3
charge 0 multiplicity 1
24 atoms
F  -1.370314 1.491354 -1.074453
F  -3.678205 0.891688 0.243297
F  -2.879653 -1.071345 1.05672
O  2.220133 -0.157357 -0.088429
O  0.754546 1.110243 1.198307
C  -0.151453 -0.535373 -0.448727
C  -0.259104 -1.930608 0.237421
C  0.211546 -0.723655 -1.952678
C  0.953165 0.256051 0.307437
C  -1.427185 0.275329 -0.354448
C  3.373064 0.488458 0.621369
C  -2.593817 0.040461 0.283564
C  4.644709 -0.101804 0.023108
H  -1.053813 -2.532009 -0.235934
H  0.701421 -2.456485 0.109318
H  -0.478409 -1.849259 1.31462
H  -0.577653 -1.312582 -2.452986
H  1.169463 -1.260142 -2.037469
H  0.304819 0.245412 -2.46922
H  3.297186 1.580307 0.472077
H  3.271556 0.280144 1.701728
H  5.528131 0.346543 0.513088
H  4.683673 -1.194345 0.172471
H  4.706092 0.106072 -1.058679
