program: Gaussian 09
title: 000177814
version: EM64L-G09RevD.01
frameworkgroup: C1[X(C8H14Cl2O2)]
method: RPBEPBE
basis: SDD
operation: Freq
keyword: #p
keyword: freq=noraman
keyword: PBEPBE/SDD
title: #p freq=noraman PBEPBE/SDD
converged: YES YES NO NO
title: Mulliken charges:
elementType: Cl Cl O O C C C C C C C C H H H H H H H H H H H H H H
charge: 0.015637 0.009283 -0.280143 -0.224666 0.206357 -0.334301 -0.738630 -0.717680 0.218140 -0.616342 -0.222640 -0.675513 0.230537 0.282940 0.206587 0.240093 0.238209 0.241019 0.217963 0.229160 0.340935 0.232700 0.226758 0.213204 0.226348 0.234044
chargesum: 0.00000
title: Mulliken charges with hydrogens summed into heavy atoms:
elementType: Cl Cl O O C C C C C C C C
charge: 0.015637 0.009283 -0.280143 -0.224666 0.206357 0.179176 -0.053741 -0.029539 0.218140 -0.275407 0.236818 -0.001917
polarizability: 1.19521599e+02 2.95494771e+00 1.11330018e+02 -1.01498064e+01 3.04792102e-01 1.00962692e+02
1716.lowfreq: -0.0035 -0.0028 -0.0026 3.0786 10.9561 13.2189 27.0256 33.4084 61.0385
frequency: 26.8903 33.2377 60.9467 80.2955 119.5841 130.8423 153.2353 197.1270 216.3145 233.0780 243.2067 261.9521 274.1247 299.9896 302.8650 309.7270 362.7829 393.3795 445.6122 487.1395 570.2772 607.1098 689.1329 723.6276 786.4674 799.9406 820.9469 882.4379 902.6042 941.4376 976.0178 1003.4921 1025.4421 1076.1323 1103.5009 1113.8913 1136.2336 1151.5138 1166.5441 1200.7023 1222.7251 1252.2637 1261.3586 1310.6663 1338.0415 1357.4625 1378.1185 1398.9030 1401.8789 1442.0170 1459.6394 1463.9750 1472.6534 1473.2507 1475.6620 1486.0350 1493.6496 1629.4681 2983.7807 2989.8484 2995.5503 2997.0371 3011.2324 3070.1504 3081.0732 3082.6575 3088.2088 3092.2759 3096.6153 3100.0151 3107.4462 3137.2069
redmass: 3.0987 11.0886 2.9998 7.9431 4.6776 2.7121 3.3373 3.6519 3.7628 1.1759 1.5317 1.1161 2.6490 3.2100 3.8550 4.2639 3.0574 2.7309 3.2560 3.2772 4.0378 4.7749 7.9280 5.8308 5.1634 1.1095 3.2226 2.7025 2.0125 1.4985 1.7423 1.3502 2.3551 2.8943 3.8270 2.2095 1.4734 2.4487 1.5283 1.2310 2.5242 1.1314 1.7762 1.3751 1.3535 1.3581 1.1952 1.2142 1.2659 1.0824 1.0502 1.0403 1.0539 1.0582 1.0521 1.0671 1.0643 10.6662 1.0348 1.0378 1.0360 1.0633 1.0581 1.1065 1.0997 1.0973 1.0992 1.0985 1.1003 1.0992 1.1028 1.0897
irintensity: 0.7346 0.1837 1.1333 1.2156 0.7951 1.3891 2.6858 0.4299 3.6431 0.2364 0.8283 0.5854 5.3408 1.9541 3.1331 2.7073 12.3205 5.1915 4.7923 3.4491 35.2350 27.2749 61.5370 27.9924 11.3679 3.4613 7.8589 7.9290 16.7335 4.9207 9.2416 2.7171 49.0097 31.0948 267.8838 27.4798 5.0626 25.5199 52.1221 6.9420 26.4357 0.1502 5.3591 19.7444 16.7803 1.2686 13.4330 43.1005 7.0602 5.8776 6.4792 12.5297 2.5653 2.8530 17.2034 10.3952 25.6361 171.4655 20.7780 19.0941 20.0111 15.2022 18.1574 5.8815 12.6138 1.7478 31.6235 29.8446 12.6168 31.7606 43.6109 6.3457
temp: 298.150 k
press: 1.00000 atm
elementType: 17 17 8 8 6 6 6 6 6 6 6 6 1 1 1 1 1 1 1 1 1 1 1 1 1 1
symmnumber: 1
zpe: 547056.2 jmol-1
zpe.correction: 0.208363 hartree
zpe.thermalcorrener: 0.223338 hartree
zpe.thermalcorrenthalpy: 0.224282 hartree
zpe.thermalcorrgfe: 0.164879 hartree
zpe.sumelectzpe: -1382.853543 hartree
zpe.sumelectthermal: -1382.838568 hartree
zpe.sumelectthermalent: -1382.837623 hartree
zpe.sumelectthermalfe: -1382.897026 hartree
dipole: -1.0332 1.2559 -2.1309
dipole: 2.6806
quadrupole: -86.5383 -82.7128 -91.1706
quadrupole: 9.9831 4.7815 -2.5749
quadrupole: 0.2689 4.0944 -4.3633 9.9831 4.7815 -2.5749
hfenergy: -1383.0619055 hartree
pointgroup: C01 [X(C8H14Cl2O2)]
dipole: 0.2862397 0.5517064 0.8520086 debye
dipolederiv: -0.3872626 0.0505117 0.2364587 0.0979324 -0.2699787 -0.205502 0.1981203 -0.1323582 -0.4150764 -0.4789419 -0.2409137 0.1617774 -0.334513 -0.406735 0.1349633 0.224324 0.1224639 -0.2904763 -1.1104771 0.5716373 -0.1787481 0.6039928 -0.8145042 0.2670137 -0.1929842 0.2821909 -0.5470728 -0.5795805 -0.0230384 0.2461469 0.1534196 -0.4910026 0.1749806 -0.032521 0.3659454 -0.7625346 0.0138517 0.0421865 0.0763486 0.0918463 0.1035722 -0.0347271 0.0824024 -0.118991 -0.0501028 -0.070862 0.0208134 0.0208092 -0.0276695 -0.1282453 -0.0313059 -0.0188947 -0.0263933 -0.1246312 -0.0055787 0.0011577 -0.0488599 -0.0076942 -0.0273696 0.0441361 -0.0169451 0.0346335 -0.0240039 -0.0452068 0.0006021 -0.0037482 -0.0501735 0.0164224 -0.0083371 -0.0421945 0.0349406 0.0191154 1.0677065 -0.375966 -0.1791952 -0.5948203 0.7855807 -0.4036329 0.1709197 -0.6122062 0.9871532 0.8990128 0.1898682 -0.4410015 0.2257408 0.6943265 0.0624485 -0.4333823 0.0991753 0.7682915 0.7721562 -0.2740473 0.0681736 -0.2529993 0.4810999 -0.0047971 -0.0338121 0.0633547 0.2366238 -0.0169164 0.0702299 -0.0447788 0.0745402 -0.037604 0.073602 -0.0352692 0.0680593 0.0111935 -0.0358276 0.0030673 0.0617567 0.0485471 0.0350027 -0.0747232 0.0842172 -0.0731956 0.0051999 0.0950935 0.0264277 -0.0667623 0.0318944 0.0077328 0.0494716 -0.068147 0.0480291 0.0579386 -0.1133968 0.0851222 0.0582094 0.0575651 0.0814037 -0.0045507 0.1031388 -0.0325315 0.031192 0.0473137 -0.1267224 0.0299954 -0.0782031 -0.0669503 0.0485118 0.0015834 0.0394601 0.0880412 0.0724688 -0.0165187 -0.0435073 -0.0234218 0.0394442 -0.1082669 -0.0753298 -0.0921907 -0.0552863 0.0542839 0.0418995 -0.079686 0.0549612 0.0326574 0.1000675 -0.0835945 0.0570345 -0.0224373 -0.0848473 0.0947521 0.0955068 0.0693067 0.0467658 -0.055238 0.0752598 -0.0674973 0.0324738 0.0177637 -0.1207458 0.0193015 -0.1180351 -0.0512413 0.0154043 0.0367049 0.0580435 0.0577483 -0.0331808 0.0185978 0.0259479 0.0410264 -0.0186645 0.0393446 0.0110753 -0.0006508 -0.0371768 -0.0094981 0.0247564 -0.0871468 0.0372443 0.0108123 -0.0438697 0.0001499 -0.0848368 -0.0731208 -0.0911401 -0.0084536 0.0107274 -0.077066 -0.0854821 0.0479697 0.046593 0.0076969 0.0666032 -0.0969142 0.1132121 0.0558865 0.1091463 0.0474172 -0.0106914 0.0754791 -0.0245251 0.0603359 0.1085061 -0.0245485 -0.025558 -0.0314934 0.0347201 -0.1057967 -0.0736195 -0.0560271 -0.0923668 0.0114738 -0.1438874 0.0319461 -0.1010744 -0.0191805 0.0335252 -0.0032737 0.0403762 0.0723759 unknown
polarizability: 120.0492167|-0.311387|110.5911734|-10.1422312|-2.5129182|101.1739187 unknown
InChI: InChI=1S/C8H14Cl2O2/c1-4-12-7(11)8(2,3)5-6(9)10/h6H,4-5H2,1-3H3
charge 0 multiplicity 1
26 atoms
Cl -1.015274 -1.69556 -1.394688
Cl -3.216736 -2.002691 0.706287
O  1.484276 -0.144859 0.393824
O  1.249706 1.157708 -1.519604
C  -0.497665 1.244948 0.255554
C  -1.336505 0.048099 0.817257
C  -1.300529 2.101695 -0.750905
C  -0.071965 2.118464 1.478203
C  0.803401 0.76057 -0.419544
C  -2.124904 -0.76729 -0.199655
C  2.74427 -0.719003 -0.170448
C  3.268694 -1.721181 0.85223
H  -2.085083 0.468373 1.518638
H  -0.679255 -0.624239 1.39461
H  -2.259253 2.420817 -0.301352
H  -0.728425 3.002225 -1.029962
H  -1.503124 1.552288 -1.686393
H  0.457873 1.512443 2.232792
H  -0.965791 2.570027 1.94645
H  0.596323 2.937157 1.156659
H  -2.808661 -0.187828 -0.830877
H  2.497651 -1.190038 -1.139117
H  3.450702 0.109672 -0.358139
H  4.200555 -2.183053 0.478108
H  3.488786 -1.227779 1.814539
H  2.531333 -2.522462 1.029934
