program: Gaussian 09
title: 000177861
version: EM64L-G09RevD.01
frameworkgroup: C1[X(C17H21ClN2O2S)]
method: RPBEPBE
basis: SDD
operation: Freq
keyword: #p
keyword: freq=noraman
keyword: PBEPBE/SDD
title: #p freq=noraman PBEPBE/SDD
converged: YES YES NO NO
title: Mulliken charges:
elementType: Cl S O O N N C C C C C C C C C C C C C C C C C H H H H H H H H H H H H H H H H H H H H H
charge: -0.048860 0.245039 -0.288210 -0.230861 -0.435364 -0.211869 -0.043495 -0.436475 -0.417078 -0.418932 -0.403702 -0.377857 -0.014506 -0.778521 0.309688 -0.694580 -0.100940 0.652870 -0.421307 -0.344173 -0.206079 -0.217010 -0.112682 0.252515 0.216776 0.198486 0.198047 0.228146 0.206097 0.207645 0.203253 0.207332 0.191861 0.205245 0.291324 0.371427 0.300779 0.225549 0.258328 0.222087 0.237993 0.255551 0.258397 0.258062
chargesum: 0.00000
title: Mulliken charges with hydrogens summed into heavy atoms:
elementType: Cl S O O N N C C C C C C C C C C C C C C C C C
charge: -0.048860 0.245039 -0.288210 -0.230861 -0.063937 -0.211869 0.209021 -0.021213 0.009115 -0.005190 0.006883 0.019249 0.276819 -0.477742 0.309688 0.011385 -0.100940 0.652870 -0.183314 -0.088622 0.052319 0.041052 -0.112682
polarizability: 2.93108133e+02 -5.65922011e+00 2.21773444e+02 -3.63205227e+00 5.97434972e+00 1.71785090e+02
1716.lowfreq: -4.8451 -0.0010 -0.0005 0.0008 4.9264 5.8081 13.2769 22.1799 44.8904
frequency: 11.2406 21.5373 44.7137 54.2496 56.1513 74.0693 76.1514 96.4070 125.7463 145.9139 164.0509 172.2584 194.0745 214.8798 244.2340 250.7868 261.8248 289.5072 311.9009 324.6661 354.9032 375.9070 387.0795 399.6830 405.7753 415.0153 451.4172 465.3698 475.1673 487.7054 499.7174 545.7022 604.9794 617.9699 630.8749 636.6235 666.0514 703.9809 713.4297 721.3185 746.6031 751.3448 778.3746 799.2739 809.9658 828.3609 833.3831 837.4354 857.8431 863.6632 900.0176 924.3155 931.1786 953.0678 966.6421 970.7630 1000.3269 1011.4937 1015.4140 1047.4838 1055.3997 1074.7213 1079.2894 1090.5376 1104.3434 1113.5082 1115.5455 1131.7883 1156.1809 1159.2600 1170.4980 1187.9555 1193.3158 1206.7742 1222.7191 1246.1428 1257.6442 1272.8100 1282.9188 1302.2018 1302.7359 1325.8443 1329.2246 1331.8475 1337.6912 1352.1586 1356.6946 1358.3091 1368.7332 1382.8559 1386.2283 1406.3308 1454.1810 1462.6826 1467.9231 1469.0339 1472.3177 1478.1887 1479.3958 1481.7365 1514.5833 1585.4489 1597.4009 1600.3393 1657.2565 2965.1833 2967.9345 2972.9019 2977.4941 2982.9399 2989.2469 3029.1337 3031.0836 3033.6751 3039.2340 3044.3023 3050.3064 3057.2446 3070.3683 3089.1917 3104.7848 3129.4782 3147.5181 3171.2165 3174.4253 3380.2724
redmass: 4.3512 5.2885 7.1730 4.7363 5.4426 3.9931 7.3756 6.1109 4.5909 4.6077 5.6614 8.8716 3.3640 2.4298 3.5918 2.2405 1.9069 3.0032 3.1293 4.9669 3.8098 3.2511 5.1581 3.7869 2.8873 6.0987 4.4957 2.7099 4.0475 2.4770 4.5083 3.6294 7.8592 6.3942 6.0619 2.6409 5.7892 4.4899 6.0523 4.8575 3.6020 1.2225 1.5106 3.5773 3.7282 1.2490 1.6548 1.6894 2.9786 2.3906 2.7376 1.8985 1.7643 1.3819 1.3822 2.1523 4.1576 2.3411 2.3517 1.4916 1.6643 2.7106 1.8605 1.7068 2.1697 1.0422 1.4504 2.1084 2.2617 2.0689 2.3671 1.3807 1.4369 2.3616 3.2786 1.3399 1.2731 1.2931 1.4052 1.3720 1.6311 2.0368 1.3958 1.4290 1.4363 1.4273 1.4660 1.4407 1.3412 2.7446 1.5079 2.2241 1.0855 1.0887 1.0845 1.0561 1.0878 1.7724 1.1789 1.2411 1.6304 7.1863 8.5820 6.1649 7.3732 1.0664 1.0620 1.0624 1.0629 1.0624 1.0358 1.0913 1.0966 1.0917 1.0987 1.1018 1.1026 1.0865 1.0867 1.0990 1.1000 1.0901 1.0891 1.0952 1.0966 1.0805
irintensity: 0.0109 0.1865 0.0221 0.4164 0.6562 0.4996 6.6992 0.1588 0.4685 3.7658 0.4317 1.1826 1.5303 0.4530 10.9386 1.6780 11.7664 8.1347 4.0441 2.9827 0.8924 0.5626 7.6534 8.3857 0.1462 17.1729 4.4601 3.5508 1.5452 1.8392 15.1796 7.7815 4.0623 9.6654 10.6553 3.2129 9.5393 25.8611 5.4980 22.1615 30.1361 92.7151 2.2871 18.7812 19.5316 0.5314 7.7460 31.8302 13.0056 9.9925 6.9339 15.2624 2.8724 0.7028 0.4101 6.0059 39.8395 1.2412 25.1947 2.2245 6.4668 51.0324 11.5889 1.4485 4.1661 0.9223 2.3322 272.9044 41.1059 31.0805 12.5174 99.1630 98.5581 64.4076 22.6769 4.2149 2.0495 4.3434 3.9025 4.8109 9.7637 43.2005 7.7959 9.2774 1.1485 0.4640 5.5989 59.8026 7.8229 8.7680 22.0141 8.0702 15.1840 6.5088 11.3686 2.3011 9.8366 100.8057 40.7899 107.8745 634.1800 1.9069 22.9288 25.2587 433.2481 26.1408 33.3521 28.2613 20.2684 29.4330 17.5114 66.2675 74.8921 14.2202 31.2021 12.4195 123.6745 4.6582 5.6983 24.4230 8.4579 8.4793 3.8958 5.2033 0.3063 108.5058
temp: 298.150 k
press: 1.00000 atm
elementType: 17 16 8 8 7 7 6 6 6 6 6 6 6 6 6 6 6 6 6 6 6 6 6 1 1 1 1 1 1 1 1 1 1 1 1 1 1 1 1 1 1 1 1 1
symmnumber: 1
zpe: 928963.8 jmol-1
zpe.correction: 0.353824 hartree
zpe.thermalcorrener: 0.375730 hartree
zpe.thermalcorrenthalpy: 0.376674 hartree
zpe.thermalcorrgfe: 0.300183 hartree
zpe.sumelectzpe: -1776.823067 hartree
zpe.sumelectthermal: -1776.801160 hartree
zpe.sumelectthermalent: -1776.800216 hartree
zpe.sumelectthermalfe: -1776.876708 hartree
dipole: 0.5958 -1.3139 0.9167
dipole: 1.7092
quadrupole: -139.4099 -144.7944 -166.5137
quadrupole: 16.0498 -0.6633 -4.8270
quadrupole: 10.8294 5.4449 -16.2744 16.0498 -0.6633 -4.8270
hfenergy: -1777.1768906 hartree
pointgroup: C01 [X(C17H21Cl1N2O2S1)]
dipole: -0.196694 -0.5724335 -0.2929817 debye
polarizability: 291.829359|10.3676643|220.7783562|-5.0221896|-12.2143433|174.0589522 unknown
InChI: InChI=1S/C17H21ClN2O2S/c1-11-15(12-7-9-13(18)10-8-12)23-17(22)20(11)16(21)19-14-5-3-2-4-6-14/h7-11,14-15,19H,2-6H2,1H3
charge 0 multiplicity 1
44 atoms
Cl 5.652167 3.302281 -0.357544
S  1.358586 -1.842897 2.006729
O  -1.197118 -0.717923 -2.13015
O  -1.239155 -0.948327 2.121175
N  -2.495633 -0.367196 -0.210621
N  -0.274763 -1.233601 -0.029975
C  -3.663956 0.182379 -0.939423
C  -4.966712 -0.184423 -0.186918
C  -3.54191 1.721464 -1.119783
C  -5.121777 0.58277 1.151195
C  -3.681455 2.479044 0.22189
C  -5.003904 2.111733 0.938426
C  0.905413 -1.837317 -0.718414
C  2.126487 -1.709907 0.237911
C  -1.364109 -0.748571 -0.874167
C  0.612751 -3.299799 -1.108556
C  -0.282689 -1.267699 1.36598
C  2.97211 -0.462981 0.088154
C  4.380234 -0.554768 0.229608
C  2.397854 0.804707 -0.193158
C  5.205283 0.583634 0.09824
C  3.206275 1.952253 -0.330626
C  4.601399 1.824026 -0.180663
H  -3.659722 -0.291774 -1.937861
H  -5.006301 -1.27767 -0.019425
H  -5.818338 0.074309 -0.847028
H  -4.344134 2.048111 -1.812643
H  -2.578233 1.952791 -1.610683
H  -4.350838 0.252591 1.878469
H  -6.098627 0.332972 1.607493
H  -3.632768 3.570224 0.043242
H  -2.825197 2.226815 0.880413
H  -5.859754 2.460365 0.323466
H  -5.071467 2.637259 1.91024
H  1.080619 -1.248002 -1.633927
H  -2.503326 -0.440392 0.817461
H  2.754448 -2.609875 0.140899
H  0.460765 -3.929391 -0.213216
H  -0.290102 -3.346108 -1.739945
H  1.455598 -3.712688 -1.69192
H  4.843855 -1.524844 0.445682
H  1.313437 0.905277 -0.306756
H  6.290773 0.506529 0.206712
H  2.761035 2.92682 -0.550085
