program: Gaussian 09
title: 000177803
version: EM64L-G09RevD.01
frameworkgroup: C1[X(C6H11NO3)]
method: RPBEPBE
basis: SDD
operation: Freq
keyword: #p
keyword: freq=noraman
keyword: PBEPBE/SDD
title: #p freq=noraman PBEPBE/SDD
converged: YES YES NO NO
title: Mulliken charges:
elementType: O O O N C C C C C C H H H H H H H H H H H
charge: -0.447599 -0.413049 -0.238008 -0.358647 -0.398961 -0.441277 -0.089601 -0.043807 -0.448363 0.133381 0.217092 0.228267 0.209705 0.238827 0.222611 0.208069 0.198599 0.204344 0.299898 0.333593 0.384927
chargesum: 0.00000
title: Mulliken charges with hydrogens summed into heavy atoms:
elementType: O O O N C C C C C C
charge: -0.114005 -0.028123 -0.238008 -0.058749 0.046398 0.007254 0.133010 0.164262 -0.045420 0.133381
polarizability: 9.74214691e+01 2.43808768e+00 8.03947051e+01 -1.83056513e+00 2.87603594e+00 5.87258019e+01
1716.lowfreq: -15.8931 -3.9025 -0.0009 -0.0008 -0.0008 14.2106 58.7526 84.5421 163.1760
frequency: 58.7078 84.5174 163.1669 219.8578 232.2036 291.4159 301.3465 314.8993 395.8545 432.0934 440.6709 485.1263 524.5087 547.2644 602.8424 623.9537 675.7716 798.7634 844.3724 919.5278 924.2088 966.5620 973.9447 1027.6790 1062.6591 1075.9484 1086.1658 1115.7791 1145.3472 1164.6314 1223.5992 1231.4524 1253.8884 1275.8281 1282.1910 1307.5008 1319.0154 1329.5558 1338.9315 1358.9052 1398.6199 1445.6005 1461.3114 1465.7512 1475.4275 1656.3025 2797.7793 2868.4870 2965.9941 2989.3215 3010.3182 3027.5975 3062.5733 3084.0096 3507.2706 3516.5798 3558.7245
redmass: 6.6407 5.3331 5.6132 2.8387 2.1780 3.0189 1.3584 3.6889 3.2758 2.4415 2.1355 3.9009 3.4518 1.5778 1.6793 2.2801 3.1670 2.4923 1.8111 1.9657 2.5971 2.7004 2.8351 2.9714 1.7547 2.4550 1.7346 2.0863 1.3482 1.9568 1.6288 1.2813 1.3530 1.3930 1.3004 1.3569 1.2961 1.3702 1.7946 1.5965 1.6143 1.3649 1.1172 1.0878 1.0936 9.0729 1.0773 1.0693 1.0838 1.0638 1.0618 1.0911 1.0987 1.1029 1.0763 1.0640 1.0661
irintensity: 1.3663 0.9502 4.3927 1.3270 7.4594 43.8903 97.0466 20.2779 5.1401 39.4831 1.9107 4.1374 47.4395 30.0111 148.6335 34.8880 46.1722 1.1796 4.2875 5.9271 2.4810 96.3533 32.8101 101.3472 94.8522 95.3921 29.9090 25.5691 10.3616 9.1425 14.6773 7.8963 7.7260 12.2323 23.4388 3.4941 10.7054 2.0149 26.7478 2.9894 0.9909 17.4223 10.5765 5.7626 8.0377 243.9881 71.1906 88.7402 42.9386 36.5373 20.1244 49.3949 37.9654 30.9841 9.4554 28.2459 2.8652
temp: 298.150 k
press: 1.00000 atm
elementType: 8 8 8 7 6 6 6 6 6 6 1 1 1 1 1 1 1 1 1 1 1
symmnumber: 1
zpe: 452860.3 jmol-1
zpe.correction: 0.172485 hartree
zpe.thermalcorrener: 0.182397 hartree
zpe.thermalcorrenthalpy: 0.183341 hartree
zpe.thermalcorrgfe: 0.137342 hartree
zpe.sumelectzpe: -514.851037 hartree
zpe.sumelectthermal: -514.841125 hartree
zpe.sumelectthermalent: -514.840181 hartree
zpe.sumelectthermalfe: -514.886180 hartree
dipole: 0.2615 -0.1710 0.2061
dipole: 0.3743
quadrupole: -58.1046 -59.8214 -60.3224
quadrupole: 11.8614 4.7898 -2.2142
quadrupole: 1.3115 -0.4053 -0.9062 11.8614 4.7898 -2.2142
hfenergy: -515.0235221 hartree
pointgroup: C01 [X(C6H11N1O3)]
dipole: 0.1030225 -0.0593374 0.0869105 debye
dipolederiv: -0.9562733 0.0530462 0.0083171 0.0975254 -0.2221302 0.1859205 0.0573755 0.1680839 -0.4828948 -0.6373726 -0.4858508 -0.0622445 -0.4628295 -0.9375172 -0.03496 -0.0499709 -0.0321339 -0.4034214 -0.7655088 0.2825858 0.0701821 0.0468502 -0.8975671 -0.0797238 0.1011925 -0.1298493 -0.3277557 -0.6272267 -0.1024324 0.0468037 -0.0608612 -0.4340084 -0.0755596 0.0458925 -0.0946091 -0.6030645 0.0688406 0.0243177 0.0191531 -0.1330776 0.0635294 0.0280176 0.0163606 0.0228508 0.1192671 -0.0306408 -0.0433324 -0.0013967 -0.0443566 0.0031329 -0.0050855 -0.0379557 0.0198489 0.1205835 -0.1567899 0.1689458 0.1062411 0.4192494 0.3445623 0.0875353 0.2119435 0.0397756 0.4223475 0.7448462 0.0102772 -0.0225532 0.0639014 0.2527036 -0.0656629 -0.0159354 -0.0272435 0.3736811 0.4611385 0.0761584 -0.1335148 0.0152323 0.0981812 0.0765855 -0.107505 0.046046 0.3572242 1.3321268 0.0457425 -0.1136079 0.1880415 1.4401627 0.1797431 -0.2060974 0.2049435 0.224359 0.0381651 0.0240743 0.0206569 0.0455549 0.0681572 -0.0443954 0.035061 0.012121 -0.1380989 0.0223412 -0.0876766 -0.0228921 -0.0871771 -0.0883808 -0.0268415 -0.0317423 -0.0594287 0.0683392 0.0516799 -0.0088011 0.0145056 -0.0218625 0.0661235 -0.0114737 0.0446439 -0.0685868 -0.1446696 -0.0077377 0.0951176 -0.0480575 0.0807847 -0.0695113 0.08287 -0.056725 0.093511 0.0323776 -0.00459 -0.0050428 0.0342156 -0.0813943 -0.0242555 -0.0532993 -0.0840257 -0.0985791 -0.2031743 -0.0270574 0.0030312 0.0330968 0.0058208 0.0007466 -0.0376328 0.0225107 -0.028462 -0.2137681 -0.050037 -0.0224278 0.0302718 0.052729 0.0486763 -0.0750698 0.1215088 0.0286431 -0.2450863 -0.025453 -0.0886379 -0.0054632 -0.1127482 -0.1447734 -0.029378 -0.0277697 -0.0684235 0.0654178 0.1336043 0.052308 -0.0283674 0.0023286 0.1065333 0.0417467 -0.0934626 0.1113761 0.2886677 0.2818348 -0.0672098 0.0156637 -0.1546598 0.0432572 -0.116467 0.009337 -0.1178411 0.3114207 0.1541099 0.075807 0.0389899 0.1409485 0.2823776 -0.0268694 0.0453637 -0.0220429 0.3782484 unknown
polarizability: 97.3653034|2.6264405|80.7911293|-1.5348607|1.3259292|58.3855435 unknown
InChI: InChI=1S/C6H11NO3/c8-4-1-2-5(6(9)10)7-3-4/h4-5,7-9H,1-3H2
charge 0 multiplicity 1
21 atoms
O  -3.531318 0.029689 0.113027
O  2.866769 1.138494 0.215156
O  2.799057 -1.153663 -0.143676
N  0.027655 -1.186267 0.004792
C  0.041396 1.251722 -0.35189
C  -1.47208 1.272396 -0.029589
C  0.708427 0.055731 0.380906
C  -2.133837 -0.079142 -0.340601
C  -1.388873 -1.223421 0.391284
C  2.197595 -0.085522 0.104933
H  0.200782 1.129201 -1.43932
H  0.51736 2.196548 -0.038103
H  -1.629506 1.488159 1.046613
H  -1.98061 2.071142 -0.598551
H  0.631521 0.272602 1.482725
H  -2.08475 -0.278085 -1.432974
H  -1.558794 -1.088372 1.489445
H  -1.811235 -2.20435 0.100789
H  0.577682 -2.035333 0.166914
H  -4.021191 -0.791431 -0.146824
H  3.841052 0.991202 0.072944
