program: Gaussian 09
title: 000177852
version: EM64L-G09RevD.01
frameworkgroup: C1[X(C17H14F3NO3)]
method: RPBEPBE
basis: SDD
operation: Freq
keyword: #p
keyword: freq=noraman
keyword: PBEPBE/SDD
title: #p freq=noraman PBEPBE/SDD
converged: YES YES NO NO
title: Mulliken charges:
elementType: F F F O O O N C C C C C C C C C C C C C C C C C H H H H H H H H H H H H H H
charge: -0.142233 -0.133617 -0.177857 -0.497672 -0.225124 -0.229707 -0.425802 0.004099 0.143371 0.397657 -0.703820 0.487520 0.316440 -0.459184 -0.354345 -0.348278 -0.367065 0.003183 0.294364 -0.372170 -0.359856 -0.236720 -0.231961 -0.229812 0.231345 0.250228 0.281882 0.377674 0.232953 0.305702 0.274938 0.270568 0.385625 0.267860 0.271273 0.232585 0.232682 0.233273
chargesum: 0.00000
title: Mulliken charges with hydrogens summed into heavy atoms:
elementType: F F F O O O N C C C C C C C C C C C C C C C C C
charge: -0.142233 -0.133617 -0.177857 -0.112047 -0.225124 -0.229707 -0.048128 0.004099 0.143371 0.397657 0.059635 0.487520 0.316440 -0.226231 -0.048643 -0.073339 -0.096497 0.003183 0.294364 -0.104310 -0.088583 -0.004135 0.000722 0.003460
polarizability: 3.46288528e+02 1.10220310e+01 1.97670225e+02 1.57789943e+00 -1.23721870e+01 1.19131153e+02
1716.lowfreq: -3.3704 -1.4993 -0.0005 0.0009 0.0009 9.5949 20.6014 22.2470 40.3382
frequency: 20.5171 22.2067 40.3336 49.3270 51.9057 66.5369 90.4542 106.2235 126.6126 146.6946 181.2882 196.2122 212.0466 221.7429 230.6995 262.0169 288.3490 289.2327 308.6418 319.0166 327.2687 349.9313 369.2107 388.8456 404.2750 418.1366 431.8565 449.4500 467.7527 501.9630 525.8669 538.0459 563.7658 606.7608 614.0373 629.9058 644.0054 680.3541 685.4943 701.5585 706.7624 750.9014 757.6395 788.0464 805.1649 839.8947 854.4819 862.0733 875.9819 880.7069 911.3855 919.5387 947.9411 979.4617 988.3012 989.2323 1001.9728 1005.9716 1006.5545 1009.4026 1027.0997 1062.0773 1065.1810 1084.3333 1087.4754 1124.8888 1132.5192 1151.7642 1163.4909 1174.5135 1187.2802 1195.4005 1204.7218 1269.5485 1286.8088 1309.1378 1318.9489 1324.2280 1375.1312 1383.1349 1392.7103 1421.3624 1433.1461 1465.7633 1472.9638 1476.7418 1494.9909 1516.9653 1539.6778 1584.3003 1589.6103 1607.6804 1618.2223 1634.2010 3005.7263 3106.6020 3123.5712 3124.9817 3128.2152 3138.2718 3149.1797 3153.6623 3159.3309 3163.6292 3169.3555 3193.8736 3445.3071 3578.2119
redmass: 8.1915 7.2095 5.9175 6.2823 9.9372 5.2349 5.7485 5.6568 7.3467 7.0266 6.9152 5.0783 6.4318 3.8156 1.1942 3.9390 5.2667 1.9989 2.4420 4.0032 5.3512 6.2683 5.8393 7.0971 2.8531 3.0180 5.0340 5.8985 13.8446 4.7881 6.1640 6.1650 4.4150 6.3767 6.4777 7.2008 7.6334 4.8173 5.9432 4.6363 1.7588 2.9060 3.5709 1.3489 2.2820 4.9218 1.3189 1.3137 3.6032 1.5832 3.8155 4.1188 1.4793 1.3959 1.5134 4.3578 1.3428 2.5709 1.7761 2.8693 2.1511 7.5594 2.9270 1.5860 1.7143 1.5937 3.4823 3.3511 2.8107 1.0572 1.1216 1.1728 4.6696 2.1182 3.4711 1.5275 1.4149 1.7180 4.7231 8.5824 1.2037 4.1062 2.2728 1.0527 1.0578 2.2327 2.4228 3.5614 4.5308 4.8824 5.4886 5.9696 5.5628 8.0165 1.0359 1.1005 1.0899 1.1003 1.0851 1.0881 1.0923 1.0910 1.0958 1.0949 1.1012 1.0950 1.0764 1.0664
irintensity: 1.1920 1.5412 1.1378 0.6980 3.7316 2.9542 0.9880 1.9917 3.0084 4.6915 2.0193 0.6200 1.2594 6.0460 2.0332 7.8521 6.4876 80.8643 62.0919 14.0954 7.2370 14.0719 5.8468 22.6660 1.4226 0.1381 13.2939 6.8373 0.8853 34.8656 4.6140 4.5191 1.0674 7.8230 0.6248 2.9221 26.5555 33.7555 14.8789 17.5397 67.0949 30.7356 20.3831 29.4972 19.2967 5.6360 27.6303 20.0018 2.5537 56.1723 46.1880 54.3138 4.1214 4.1761 9.3342 0.3849 1.7338 195.5996 79.7923 0.4460 3.8663 151.6917 188.9733 11.4301 87.4854 6.1097 30.7891 7.5551 33.4292 0.6370 65.1935 18.7532 52.9170 8.7509 410.1687 73.6344 34.6545 29.2777 29.3438 1.7161 33.9066 16.2205 12.7408 22.6411 18.3124 0.3135 191.3351 492.0665 105.0526 37.5301 124.3451 40.7650 134.4359 133.9942 11.7865 13.8405 14.0445 2.6911 0.2841 6.0424 25.1799 1.8986 18.3959 4.6866 23.0090 2.8926 125.0300 22.3731
temp: 298.150 k
press: 1.00000 atm
elementType: 9 9 9 8 8 8 7 6 6 6 6 6 6 6 6 6 6 6 6 6 6 6 6 6 1 1 1 1 1 1 1 1 1 1 1 1 1 1
symmnumber: 1
zpe: 725091.9 jmol-1
zpe.correction: 0.276173 hartree
zpe.thermalcorrener: 0.297975 hartree
zpe.thermalcorrenthalpy: 0.298919 hartree
zpe.thermalcorrgfe: 0.223219 hartree
zpe.sumelectzpe: -1234.463982 hartree
zpe.sumelectthermal: -1234.442180 hartree
zpe.sumelectthermalent: -1234.441236 hartree
zpe.sumelectthermalfe: -1234.516935 hartree
dipole: 2.5342 0.5431 0.8650
dipole: 2.7323
quadrupole: -117.9892 -138.7288 -139.9668
quadrupole: 32.8294 4.1282 0.4654
quadrupole: 14.2390 -6.5005 -7.7385 32.8294 4.1282 0.4654
hfenergy: -1234.7401549 hartree
pointgroup: C01 [X(C17H14F3N1O3)]
dipole: 1.0358079 0.04117 -0.2845589 debye
polarizability: 345.7848577|0.142372|190.9821125|16.8944861|24.1441384|126.3229355 unknown
InChI: InChI=1S/C17H14F3NO3/c1-16(24,17(18,19)20)15(23)21-13-9-7-12(8-10-13)14(22)11-5-3-2-4-6-11/h2-10,21,24H,1H3
charge 0 multiplicity 1
38 atoms
F  4.071827 0.45162 2.752615
F  4.86346 2.437879 2.006162
F  6.217473 0.614732 2.02682
O  4.69552 -0.784366 0.194675
O  2.502212 2.087293 0.013503
O  -3.788755 -2.280501 -1.054908
N  2.202654 -0.255804 0.102735
C  4.4740 0.659766 0.323423
C  2.940307 0.908077 0.130583
C  4.880463 1.057278 1.774022
C  5.281629 1.476615 -0.697728
C  0.800856 -0.405575 -0.048114
C  -1.99502 -0.86095 -0.325813
C  0.284921 -1.73277 -0.06269
C  -0.085139 0.695981 -0.187898
C  -1.091004 -1.952948 -0.210143
C  -1.467187 0.458112 -0.319138
C  -3.448701 -1.167751 -0.53671
C  -4.508043 -0.175199 -0.143808
C  -4.352873 0.726533 0.944064
C  -5.743337 -0.20608 -0.846536
C  -5.410091 1.58819 1.310595
C  -6.790833 0.665602 -0.490463
C  -6.62637 1.567363 0.589474
H  6.364682 1.416955 -0.490138
H  5.08626 1.077025 -1.70656
H  4.965133 2.531189 -0.671566
H  2.769185 -1.110455 0.188894
H  0.968836 -2.584367 0.040168
H  0.31421 1.711625 -0.196896
H  -1.497154 -2.968747 -0.245714
H  -2.137824 1.312806 -0.452673
H  5.657272 -0.999452 0.289068
H  -3.424435 0.729479 1.524539
H  -5.8583 -0.927057 -1.662668
H  -5.287407 2.269546 2.159607
H  -7.734584 0.642805 -1.046202
H  -7.442742 2.241852 0.871216
