program: Gaussian 09
title: 000177790
version: EM64L-G09RevD.01
frameworkgroup: C1[X(C8H6ClN)]
method: RPBEPBE
basis: SDD
operation: Freq
keyword: #p
keyword: freq=noraman
keyword: PBEPBE/SDD
title: #p freq=noraman PBEPBE/SDD
converged: NO YES NO YES
title: Mulliken charges:
elementType: Cl N C C C C C C C C H H H H H H
charge: -0.048767 -0.420333 0.416014 0.240210 -0.296735 -0.388370 -0.333111 -0.231853 -0.239006 -0.210614 0.311803 0.251378 0.229670 0.271543 0.224406 0.223764
chargesum: 0.00000
title: Mulliken charges with hydrogens summed into heavy atoms:
elementType: Cl N C C C C C C C C
charge: -0.048767 -0.108529 0.416014 0.240210 -0.296735 -0.136992 -0.103441 0.039690 -0.014600 0.013150
polarizability: 1.36934633e+02 6.72601678e+00 1.12920992e+02 -1.31870887e-03 -1.70555767e-03 3.91731247e+01
1716.lowfreq: -5.4904 0.0006 0.0019 0.0024 5.2624 11.0430 134.3625 167.2727 215.8935
frequency: 134.3606 167.2688 215.8931 301.0015 405.1733 420.3788 455.5105 499.7405 550.4037 574.1057 595.3721 632.7171 749.7325 755.5140 758.6774 785.0040 854.7389 862.7699 937.5490 974.6333 975.9288 1009.8021 1089.9275 1125.3252 1166.6795 1199.6134 1243.5875 1283.3900 1334.7581 1371.0094 1418.5675 1457.7264 1485.1990 1528.9886 1588.2192 1631.9731 3127.7505 3137.8591 3152.5505 3167.1793 3246.3463 3612.0330
redmass: 5.3942 8.7670 4.0305 7.3378 11.3726 2.8804 4.3186 1.2028 7.1025 3.0171 3.3418 7.2168 1.5484 5.4582 2.7202 1.3928 1.4549 5.0775 1.3715 6.1870 1.3007 2.1170 1.6437 1.5032 1.0839 2.3559 1.5608 2.4086 2.0479 3.8213 2.4790 4.7182 2.9534 5.3533 6.2414 7.3056 1.0854 1.0893 1.0952 1.1002 1.0994 1.0810
irintensity: 0.8861 0.4088 10.3018 0.0953 3.2176 13.9959 3.3877 100.9510 0.0970 7.2410 0.0130 12.0854 99.0634 5.5298 35.4137 18.5199 1.2346 0.2215 3.6028 49.5671 0.0568 10.9653 26.2852 7.3710 2.7504 30.4328 16.1314 2.4987 27.7725 20.8811 6.0880 16.1859 3.4330 4.6173 2.6625 4.0605 0.2204 10.2313 23.7498 22.3302 0.4548 66.6665
temp: 298.150 k
press: 1.00000 atm
elementType: 17 7 6 6 6 6 6 6 6 6 1 1 1 1 1 1
symmnumber: 1
zpe: 310939.1 jmol-1
zpe.correction: 0.118430 hartree
zpe.thermalcorrener: 0.126057 hartree
zpe.thermalcorrenthalpy: 0.127002 hartree
zpe.thermalcorrgfe: 0.085716 hartree
zpe.sumelectzpe: -822.572659 hartree
zpe.sumelectthermal: -822.565032 hartree
zpe.sumelectthermalent: -822.564088 hartree
zpe.sumelectthermalfe: -822.605373 hartree
dipole: -1.5769 3.0308 0.0000
dipole: 3.4165
quadrupole: -62.4310 -49.8076 -69.9413
quadrupole: 1.4768 -0.0002 -0.0004
quadrupole: -1.7044 10.9190 -9.2147 1.4768 -0.0002 -0.0004
hfenergy: -822.6910891 hartree
pointgroup: C01 [X(C8H6Cl1N1)]
dipole: -0.3447423 1.2991768 0.0000098 debye
dipolederiv: -0.445587 0.2441968 -0.0000011 0.3234315 -0.3483643 0.0000023 -0.0000063 0.0000073 -0.0375308 -0.4354505 0.2417038 -0.0000004 -0.1385326 -0.6441968 0.0000246 0.0000131 0.0000527 -0.2859929 0.1192152 0.2055356 -0.0000054 0.0116781 -0.2933852 0.0000083 0.0000001 0.0000076 0.0554673 0.0784704 0.2082452 -0.0000147 0.4756492 0.2260479 -0.0000203 -0.0000146 -0.0000199 0.0236238 0.6068296 -0.5418802 0.0000073 -0.4980978 0.3517793 -0.0000007 0.0000067 -0.0000134 -0.1661365 0.1086931 -0.0407248 -0.0000018 0.0459521 0.0735791 -0.0000093 -0.0000008 -0.0000195 -0.1640331 0.0769366 -0.0810272 -0.0000008 -0.0083782 0.0092973 0.0000005 -0.00001 0.0000049 -0.181307 -0.1471755 -0.3235601 0.0000124 -0.2068825 0.3426931 -0.0000151 -0.0000053 -0.0000263 -0.1258885 -0.1129362 0.0855505 -0.0000083 0.1166716 0.0526259 -0.0000063 -0.0000051 -0.0000055 -0.1788862 0.0041491 -0.0416394 -0.0000074 -0.1292621 0.0282394 -0.0000042 -0.0000008 -0.0000004 -0.1795548 0.15027 0.0404172 0.000002 0.022559 0.224142 -0.0000003 0. -0.0000148 0.3485201 0.0671764 0.0723381 -0.0000004 0.0325279 -0.0464118 0.0000058 -0.0000021 0.0000133 0.1649523 0.0497562 0.0449099 0.0000018 0.081784 -0.0953836 0.000002 0.0000035 -0.0000004 0.1764338 0.0285589 -0.0399881 0.0000019 -0.0456514 0.080943 0.000004 0.0000062 0.0000074 0.22089 -0.0143238 -0.1075024 0.0000076 -0.1126942 -0.0455378 0.0000075 0.0000078 0.0000072 0.1650411 -0.1345828 0.0334251 0.0000074 0.0292454 0.0839323 0.0000013 0.0000076 -0.0000004 0.1644014 unknown
polarizability: 138.6565908|0.9610884|111.1990346|-0.0016596|-0.0013761|39.1731247 unknown
InChI: InChI=1S/C8H6ClN/c9-7-5-10-8-4-2-1-3-6(7)8/h1-5,10H
charge 0 multiplicity 1
16 atoms
Cl 2.849917 -1.579038 -0.000033
N  0.736481 1.824559 -0.000096
C  0.210616 -0.409238 -0.000038
C  -0.338159 0.924353 -0.000047
C  1.643879 -0.244948 -0.000054
C  -0.663156 -1.526745 -0.000009
C  -1.731598 1.157731 -0.000028
C  1.945864 1.111965 -0.000074
C  -2.050775 -1.294691 0.000034
C  -2.578982 0.032156 0.00002
H  0.657327 2.838941 -0.000096
H  -0.259297 -2.544508 0.00002
H  -2.143468 2.173209 -0.000032
H  2.912762 1.608818 -0.000091
H  -2.743835 -2.14311 0.000076
H  -3.664977 0.176946 0.000048
