program: Gaussian 09
title: 000177806
version: EM64L-G09RevD.01
frameworkgroup: C1[X(C8H17NO)]
method: RPBEPBE
basis: SDD
operation: Freq
keyword: #p
keyword: freq=noraman
keyword: PBEPBE/SDD
title: #p freq=noraman PBEPBE/SDD
converged: YES YES NO NO
title: Mulliken charges:
elementType: O N C C C C C C C C H H H H H H H H H H H H H H H H H
charge: -0.262950 -0.620677 -0.006236 -0.392450 -0.390593 -0.381594 -0.740332 -0.518662 -0.714371 0.228226 0.192321 0.193458 0.182259 0.215495 0.191005 0.200511 0.251231 0.209824 0.211609 0.212974 0.205174 0.235565 0.215658 0.222633 0.216208 0.311400 0.332311
chargesum: 0.00000
title: Mulliken charges with hydrogens summed into heavy atoms:
elementType: O N C C C C C C C C
charge: -0.262950 0.023035 0.186084 -0.016733 0.015908 0.070149 -0.105924 -0.077923 -0.059873 0.228226
polarizability: 1.15985205e+02 3.19252170e+00 9.63928016e+01 1.09236773e+00 -2.42509649e+00 7.64666418e+01
1716.lowfreq: -33.1902 -11.6456 -1.1045 -0.0009 -0.0008 -0.0007 23.2895 28.7341 65.4846
frequency: 15.1614 26.5453 65.2584 89.3110 106.3348 137.2745 213.2212 229.0579 240.5723 257.2170 273.1766 389.7208 392.6824 457.8814 498.4294 515.4712 530.7227 597.7174 672.6687 732.9667 760.0659 766.8594 843.1641 852.9743 918.3984 971.8951 977.8664 1001.5163 1010.3468 1038.0950 1056.4332 1073.2952 1108.8825 1145.3652 1153.3982 1178.9960 1238.0426 1253.8372 1271.1510 1284.2948 1287.0698 1319.8957 1330.8218 1350.8756 1355.1116 1367.8098 1380.1865 1386.6483 1443.0080 1460.2909 1467.0131 1477.2540 1480.2646 1481.3888 1489.2110 1490.6817 1593.6283 1642.0701 2941.7413 2950.4916 2968.5832 2969.6354 2975.5346 2980.4079 2981.3670 3000.9369 3021.6039 3022.8782 3061.3360 3064.0941 3066.2265 3072.1095 3074.9743 3515.1388 3673.2752
redmass: 3.5218 4.1532 2.5342 2.9681 2.2259 1.7494 1.4316 2.0591 1.4862 1.8737 2.6085 2.8857 2.2042 2.1740 1.3914 1.8937 1.9611 1.7728 2.1044 1.3523 1.9483 1.2427 1.6248 2.4419 1.7555 1.4010 2.0391 1.7324 1.5102 2.1795 2.2509 2.4316 1.6607 2.2377 1.5294 1.8482 1.3428 1.3102 1.1670 1.2023 1.3367 1.5607 1.4734 1.3569 1.6454 2.2427 1.2400 1.2109 1.0988 1.0687 1.0563 1.0691 1.0514 1.0680 1.0586 1.0675 1.4101 3.7388 1.0796 1.0606 1.0582 1.0378 1.0543 1.0448 1.0664 1.0955 1.0996 1.0984 1.1004 1.0995 1.0993 1.0989 1.0998 1.0445 1.1043
irintensity: 4.9335 6.9910 1.4923 3.4684 0.7018 1.1426 1.5834 2.4097 0.2420 0.0877 1.3772 3.2064 0.5576 5.4076 98.2047 60.0729 54.4142 58.2211 39.5474 12.5592 1.7076 8.8250 1.8177 2.9079 1.9100 1.7353 3.6458 0.8051 8.4298 0.2536 1.0099 0.7701 2.1508 0.5429 9.7906 2.3274 5.3208 10.6444 17.1240 46.5651 8.6585 11.0052 29.2790 9.0045 3.4720 85.6305 16.6378 17.5101 10.9716 1.1412 4.3049 10.0526 10.0324 28.5896 6.4695 3.0087 65.4947 278.2314 16.8947 30.8168 11.2360 43.0048 45.9147 16.0424 40.6701 51.8187 16.1626 19.2485 3.9469 107.8967 40.1031 62.0583 57.2609 26.0950 20.3877
temp: 298.150 k
press: 1.00000 atm
elementType: 8 7 6 6 6 6 6 6 6 6 1 1 1 1 1 1 1 1 1 1 1 1 1 1 1 1 1
symmnumber: 1
zpe: 630969.3 jmol-1
zpe.correction: 0.240324 hartree
zpe.thermalcorrener: 0.253169 hartree
zpe.thermalcorrenthalpy: 0.254113 hartree
zpe.thermalcorrgfe: 0.199106 hartree
zpe.sumelectzpe: -444.211744 hartree
zpe.sumelectthermal: -444.198899 hartree
zpe.sumelectthermalent: -444.197955 hartree
zpe.sumelectthermalfe: -444.252961 hartree
dipole: -0.9175 -3.7481 0.4982
dipole: 3.8908
quadrupole: -53.1180 -66.5510 -64.2445
quadrupole: 12.4950 -1.5875 0.4507
quadrupole: 8.1865 -5.2465 -2.9400 12.4950 -1.5875 0.4507
hfenergy: -444.4520674 hartree
pointgroup: C01 [X(C8H17N1O1)]
dipole: 0.3761198 1.4830047 0.0491786 debye
polarizability: 116.100469|2.8188848|96.6148113|0.3847975|0.3245883|76.1293684 unknown
InChI: InChI=1S/C8H17NO/c1-3-7(2)5-4-6-8(9)10/h7H,3-6,9H2,1-2H3
charge 0 multiplicity 1
27 atoms
O  2.779329 -1.495389 0.199784
N  4.054859 0.438213 0.23538
C  -2.190076 0.498559 -0.550074
C  -0.921906 0.879236 0.26279
C  -2.514834 -1.024825 -0.514118
C  0.361701 0.140738 -0.174056
C  -3.398144 1.352685 -0.09304
C  1.613281 0.643531 0.579442
C  -2.74283 -1.619948 0.894476
C  2.843646 -0.235929 0.315888
H  -1.985345 0.751956 -1.61391
H  -1.105627 0.69079 1.341329
H  -0.765474 1.974978 0.167262
H  -1.696628 -1.583091 -1.009875
H  -3.420779 -1.197542 -1.130302
H  0.51329 0.266493 -1.2653
H  0.273323 -0.945948 0.005908
H  -3.189642 2.432513 -0.214201
H  -3.634457 1.177672 0.973464
H  -4.30284 1.1133 -0.682945
H  1.823353 1.70212 0.328798
H  1.413028 0.607625 1.670416
H  -2.984857 -2.696419 0.826155
H  -1.840721 -1.524199 1.526046
H  -3.579243 -1.123721 1.419927
H  4.11644 1.451627 0.31159
H  4.906854 -0.105525 0.096965
