program: Gaussian 09
title: 000177794
version: EM64L-G09RevD.01
frameworkgroup: C1[X(C12H6S2)]
method: RPBEPBE
basis: SDD
operation: Freq
keyword: #pfreq=noraman
keyword: PBEPBE/SDD
title: #p freq=noraman PBEPBE/SDD
converged: NO YES NO NO
title: Mulliken charges:
elementType: S S C C C C C C C C C C C C H H H H H H
charge: 0.259509 0.259551 -0.263185 -0.263229 -0.276030 -0.275988 -0.129469 -0.129468 -0.517024 -0.517051 0.129459 0.129446 0.009780 0.009766 0.268488 0.268491 0.249125 0.249126 0.269350 0.269354
chargesum: 0.00000
title: Mulliken charges with hydrogens summed into heavy atoms:
elementType: S S C C C C C C C C C C C C
charge: 0.259509 0.259551 -0.263185 -0.263229 -0.007542 -0.007498 0.119656 0.119659 -0.247674 -0.247696 0.129459 0.129446 0.009780 0.009766
polarizability: 5.23997043e+02 -2.79657130e-04 1.26965445e+02 -8.88001760e+00 6.24207292e-04 6.98318282e+01
1716.lowfreq: 0.0010 0.0014 0.0020 1.7895 3.2030 8.0732 8.6745 30.8501 37.5568
frequency: 8.2978 30.8408 37.5469 87.1851 103.3650 195.2427 196.6643 238.2576 327.6999 372.9603 407.5273 444.9801 476.2230 485.2851 501.6051 518.0101 526.4433 570.8816 571.1416 607.1509 620.9845 674.7238 694.1872 703.3950 703.4329 799.7905 816.4748 835.1021 835.2560 876.4802 916.6780 916.7014 1030.2192 1055.0070 1079.8730 1091.4167 1134.6686 1194.3004 1230.5991 1297.6243 1336.2367 1382.6157 1457.4766 1468.4055 1517.5397 1566.4487 2150.7789 2218.5622 3176.7844 3176.8466 3195.2351 3195.2750 3235.9310 3235.9679
redmass: 6.7415 7.4199 6.6506 7.1788 6.3704 10.7991 6.6530 6.8477 7.4516 8.7613 9.5219 9.1784 8.6404 9.4029 6.3275 6.6757 9.1492 3.4401 3.4597 9.7358 8.2363 7.8603 8.2405 1.1699 1.1718 5.0751 4.7820 1.3097 1.3096 7.2831 1.3642 1.3642 2.1053 1.7189 1.2862 1.0967 2.1138 1.6822 1.4839 2.1555 2.4789 3.9529 7.2828 5.7884 5.3679 8.2039 11.9946 11.9971 1.0893 1.0893 1.0980 1.0980 1.1002 1.1002
irintensity: 0.0375 1.3105 2.1079 0.1253 0.0984 0.0592 0.4958 0.0005 0.0208 0.6695 3.0286 0.3227 0.1405 20.9433 4.3227 1.0887 1.7047 0.8441 3.2677 2.9011 1.8520 0.1815 6.2781 181.1029 38.8327 35.3337 36.4506 6.1800 35.4840 2.4930 0.1396 0.2943 4.5741 8.8829 21.3787 0.7284 73.1627 11.1558 12.9780 1.5113 0.8683 6.2902 9.7508 9.9093 6.7838 0.0008 1.0407 0.3935 20.9947 0.7672 5.5296 1.8627 0.6640 0.6993
temp: 298.150 k
press: 1.00000 atm
elementType: 16 16 6 6 6 6 6 6 6 6 6 6 6 6 1 1 1 1 1 1
symmnumber: 1
zpe: 344095.8 jmol-1
zpe.correction: 0.131059 hartree
zpe.thermalcorrener: 0.143877 hartree
zpe.thermalcorrenthalpy: 0.144821 hartree
zpe.thermalcorrgfe: 0.087680 hartree
zpe.sumelectzpe: -1255.937592 hartree
zpe.sumelectthermal: -1255.924774 hartree
zpe.sumelectthermalent: -1255.923830 hartree
zpe.sumelectthermalfe: -1255.980971 hartree
dipole: 0.0003 1.2194 0.0002
dipole: 1.2194
quadrupole: -56.3362 -89.5847 -99.0550
quadrupole: -0.0006 -3.0225 -0.0001
quadrupole: 25.3224 -7.9261 -17.3963 -0.0006 -3.0225 -0.0001
hfenergy: -1256.0686508 hartree
pointgroup: C01 [X(C12H6S2)]
dipole: -0.0001009 -0.4797388 0.0000715 debye
dipolederiv: -0.0463319 0.0914774 -0.0432614 -0.0493902 -0.1842263 0.1416577 0.0550372 0.1456307 0.0859722 -0.046206 -0.0914963 -0.0432638 0.0493771 -0.1842011 -0.1416679 0.0550353 -0.1456371 0.0860041 0.3609316 0.1303015 -0.0522318 0.468554 0.3306628 -0.2061073 -0.2331225 -0.2037558 -0.0438479 0.3607967 -0.1303325 -0.05225 -0.4684991 0.3306051 0.2061039 -0.2330825 0.2037533 -0.0438654 0.1211105 0.1288469 -0.0550554 -0.0909871 -0.1141601 -0.0161214 0.0420009 -0.0152341 -0.1465165 0.1210904 -0.128812 -0.0550544 0.0909633 -0.1141639 0.0161232 0.0419649 0.0152398 -0.1465191 -0.143641 -0.0889117 0.0398659 -0.3016022 -0.1903748 0.0235314 0.1902585 0.0237636 -0.1465452 -0.1436111 0.088897 0.039854 0.3016342 -0.190341 -0.0235345 0.1902747 -0.0237669 -0.1465201 -0.5091783 -0.2308431 0.1068376 -0.0147896 0.1262995 -0.1880944 -0.0012465 -0.1875858 -0.2317836 -0.5092657 0.2308774 0.1068413 0.0147483 0.1263055 0.1881065 -0.00125 0.1875898 -0.2317982 0.1615763 -0.0240011 0.0101826 -0.0125431 -0.1187594 0.0720518 -0.0023877 0.0667134 -0.0235226 0.161718 0.0240121 0.0101694 0.0124461 -0.1187526 -0.0720532 -0.0024908 -0.0667145 -0.0235189 -0.0353785 0.018113 0.0015296 -0.0308845 -0.0125353 -0.0349859 0.022514 -0.0305908 -0.0296304 -0.0355269 -0.0181206 0.0015441 0.0309697 -0.0125531 0.0349845 0.0225968 0.0305889 -0.029646 0.1285322 -0.0289468 0.0108884 -0.0731558 0.0098537 0.08093 0.0123438 0.079054 0.1640267 0.1285353 0.0289569 0.0108982 0.0731732 0.0098815 -0.0809203 0.0123532 -0.0790428 0.1640276 -0.0377859 0.0648309 -0.0305322 0.1050967 0.056665 0.0619634 -0.0471467 0.0606528 0.17184 -0.0377749 -0.0648323 -0.0305243 -0.1051204 0.0566553 -0.0619624 -0.0471468 -0.0606533 0.1718358 0.0001898 -0.0361323 0.0117793 -0.0070695 0.0965716 0.051946 -0.0382611 0.0495587 0.2000045 0.0002192 0.0361156 0.0117829 0.007079 0.0965676 -0.0519511 -0.0382446 -0.049564 0.2000031 unknown
polarizability: 524.1691887|-0.0008716|126.9654447|0.8016758|0.0004198|69.6596829 unknown
InChI: InChI=1S/C12H6S2/c1(5-11-7-3-9-13-11)2-6-12-8-4-10-14-12/h3-4,7-10H
charge 0 multiplicity 1
20 atoms
S  4.240853 1.375234 -0.576648
S  -4.240393 1.375269 0.577084
C  3.329402 -0.091322 0.044878
C  -3.328927 -0.091221 -0.04448
C  4.237361 -1.069245 0.473692
C  -4.236854 -1.069236 -0.473299
C  5.614373 -0.697121 0.329436
C  -5.613808 -0.697173 -0.328997
C  5.794885 0.570891 -0.207464
C  -5.794377 0.570843 0.207933
C  1.929471 -0.119551 0.035771
C  -1.928966 -0.119551 -0.035461
C  0.67904 -0.111205 0.010396
C  -0.678523 -0.111215 -0.010112
H  3.900119 -2.024665 0.881653
H  -3.899486 -2.024611 -0.881262
H  6.446157 -1.344109 0.617245
H  -6.445561 -1.344212 -0.616794
H  6.723858 1.099516 -0.414808
H  -6.723323 1.099483 0.415337
