program: Gaussian 09
title: 000177767
version: EM64L-G09RevD.01
frameworkgroup: C1[X(C2H2Cl2O)]
method: RPBEPBE
basis: SDD
operation: Freq
keyword: #p
keyword: freq=noraman
keyword: PBEPBE/SDD
title: #p freq=noraman PBEPBE/SDD
converged: NO NO NO NO
title: Mulliken charges:
elementType: Cl Cl O C C H H
charge: 0.022388 0.022454 -0.190063 -0.216282 -0.216310 0.288903 0.288910
chargesum: 0.00000
title: Mulliken charges with hydrogens summed into heavy atoms:
elementType: Cl Cl O C C
charge: 0.022388 0.022454 -0.190063 0.072621 0.072600
polarizability: 4.71843041e+01 3.72435226e-04 4.55815882e+01 1.58114450e-04 3.98751042e+00 2.45018732e+01
1716.lowfreq: -0.0044 -0.0032 -0.0010 5.5454 11.5813 12.1049 146.2436 282.5814 378.0487
frequency: 146.2427 282.5813 378.0470 439.5453 605.3824 671.8803 735.8989 848.4128 1037.7597 1039.4442 1233.4683 1269.8082 1302.8796 3151.5275 3165.5841
redmass: 28.0803 5.9752 16.9481 8.0029 4.3648 10.9439 5.8338 4.7818 1.2306 1.4802 1.2604 1.1074 3.5352 1.0867 1.0970
irintensity: 0.1465 1.7057 0.8735 13.1150 86.3821 163.2622 2.9834 51.8532 0.9958 12.1862 7.5370 11.4744 68.2035 0.0190 13.5261
temp: 298.150 k
press: 1.00000 atm
elementType: 17 17 8 6 6 1 1
symmnumber: 1
zpe: 97546.3 jmol-1
zpe.correction: 0.037153 hartree
zpe.thermalcorrener: 0.042230 hartree
zpe.thermalcorrenthalpy: 0.043174 hartree
zpe.thermalcorrgfe: 0.007562 hartree
zpe.sumelectzpe: -1072.300833 hartree
zpe.sumelectthermal: -1072.295756 hartree
zpe.sumelectthermalent: -1072.294812 hartree
zpe.sumelectthermalfe: -1072.330424 hartree
dipole: 0.0004 1.4282 2.5521
dipole: 2.9246
quadrupole: -42.5325 -41.9111 -42.2431
quadrupole: -0.0004 -0.0002 4.4344
quadrupole: -0.3036 0.3178 -0.0142 -0.0004 -0.0002 4.4344
hfenergy: -1072.3379861 hartree
pointgroup: C01 [X(C2H2Cl2O1)]
dipole: -0.0006092 0.4449546 -1.061091 debye
dipolederiv: -0.3400851 0.2220034 -0.0228002 0.3468904 -0.4252639 0.0523339 -0.1145573 0.131605 -0.136332 -0.339539 -0.2218552 0.022868 -0.3467851 -0.4255907 0.0525347 0.1145664 0.131805 -0.1363501 -0.6282796 -0.0000795 0.000071 -0.000028 -0.6570601 -0.1143891 0.0001979 -0.3847026 -0.4787714 0.6608231 -0.3478089 0.0554578 -0.7089291 0.7612045 -0.0923529 -0.0916317 -0.0223415 0.331548 0.6600075 0.3476904 -0.0555498 0.7087886 0.7618814 -0.0927767 0.0914715 -0.0224848 0.3314744 -0.0064742 0.0437519 0.0561481 0.0349481 -0.0075583 0.0973313 0.020171 0.0830594 0.0441851 -0.0064527 -0.0437021 -0.0561949 -0.0348849 -0.0076129 0.0973188 -0.0202177 0.0830596 0.044246 unknown
polarizability: 47.1843038|-0.0009685|44.4184378|-0.0031162|-6.2502956|25.6650239 unknown
InChI: InChI=1S/C2H2Cl2O/c3-1-2(4)5-1/h1-2H
charge 0 multiplicity 1
7 atoms
Cl 1.696803 -1.036375 0.168639
Cl -1.696131 -1.037598 0.169522
O  -0.000363 1.225632 0.53884
C  0.745411 0.398167 -0.450506
C  -0.746143 0.397564 -0.450097
H  1.334559 0.952815 -1.186633
H  -1.336036 0.951896 -1.185866
