program: Gaussian 09
title: 000177802
version: EM64L-G09RevD.01
frameworkgroup: C1[X(C17H16)]
method: RPBEPBE
basis: SDD
operation: Freq
keyword: #p
keyword: freq=noraman
keyword: PBEPBE/SDD
title: #p freq=noraman PBEPBE/SDD
converged: YES YES NO NO
title: Mulliken charges:
elementType: C C C C C C C C C C C C C C C C C H H H H H H H H H H H H H H H H
charge: 0.132527 0.277205 0.042763 0.192117 0.302492 0.174958 -0.580459 -0.403411 -0.865732 -0.387752 -0.404797 -0.380006 -0.691532 -0.284972 -0.269837 -0.271531 -0.268950 0.218578 0.224202 0.239332 0.235884 0.242653 0.236165 0.225568 0.252554 0.225241 0.224294 0.217629 0.234780 0.226828 0.228475 0.226721 0.228012
chargesum: 0.00000
title: Mulliken charges with hydrogens summed into heavy atoms:
elementType: C C C C C C C C C C C C C C C C C
charge: 0.132527 0.277205 0.042763 0.192117 0.302492 0.174958 -0.137679 -0.164079 -0.151029 -0.162184 -0.152242 -0.154765 -0.014830 -0.058144 -0.041363 -0.044809 -0.040938
polarizability: 2.70269546e+02 -1.62492334e+01 2.20063251e+02 -4.79576063e+00 -4.91669771e+00 8.58463479e+01
1716.lowfreq: -16.3580 -8.7748 -0.0003 -0.0002 0.0004 0.8816 57.2215 62.7116 94.2533
frequency: 57.1983 62.5811 94.2292 107.8093 143.9191 180.7360 203.0576 218.3918 257.4325 277.2554 319.4228 368.1364 406.1595 413.9623 425.4885 439.1211 445.8863 477.9483 547.2820 557.5501 575.2920 593.5571 615.9054 663.0828 675.7820 737.3544 759.2830 762.4361 768.5617 776.2859 815.2568 820.7675 872.3029 911.1353 918.0848 951.8030 957.8442 973.6132 985.5010 989.6447 991.4025 1033.1192 1038.3287 1047.8699 1061.7204 1071.0657 1090.8824 1097.8150 1109.9837 1167.0329 1184.8402 1186.5181 1239.7761 1254.7008 1266.7251 1286.4924 1308.0256 1325.1743 1354.7852 1385.0653 1392.7494 1394.3380 1404.2203 1435.7060 1440.7322 1448.2408 1470.2466 1472.6431 1479.7285 1486.5021 1493.0025 1522.9179 1540.0446 1580.4139 1597.7395 1616.4445 1618.2491 2976.5724 2978.2501 3012.9042 3044.3004 3051.2023 3074.9854 3082.7168 3115.7957 3126.2172 3127.6524 3140.3587 3145.2395 3156.7287 3163.1908 3169.2847 3172.0707
redmass: 3.2871 2.9023 3.3982 3.2219 3.2299 1.1185 1.0586 3.3878 4.4374 3.8070 2.9664 4.0573 5.4240 4.2281 2.7332 3.1539 3.8521 3.9010 3.4218 3.2262 3.2885 4.2953 6.7042 4.3795 3.5438 2.1954 3.3270 1.9532 1.5997 1.6588 1.5950 1.7717 1.4156 2.9543 2.9456 1.4287 1.3767 2.0130 1.3496 1.3484 6.6800 1.7033 2.2834 2.1389 2.2429 1.9602 2.6858 1.6539 2.3014 1.3134 1.1537 1.1118 1.3748 1.5316 2.4725 1.5432 1.4870 2.4147 3.4275 1.3539 3.5085 1.3950 4.1238 2.3566 2.6096 2.7895 1.0459 1.2448 1.1051 1.0528 2.1534 1.3796 2.2259 7.6246 6.4965 5.7812 6.2641 1.0413 1.0351 1.0623 1.0968 1.0982 1.0998 1.1008 1.0933 1.0848 1.0853 1.0897 1.0898 1.0952 1.0922 1.0983 1.0976
irintensity: 0.0666 0.0129 0.0542 1.3833 2.3357 0.6503 0.0896 0.5985 0.3789 0.0887 0.8196 1.2357 1.1304 0.8771 1.3460 4.0644 0.6656 0.4417 2.5733 0.1176 0.3986 0.1711 4.1084 0.2541 1.7844 59.2416 5.5603 4.9515 100.3120 15.7968 0.6063 1.0384 0.0868 1.0562 3.6089 0.0462 1.9675 6.4050 0.0954 0.0446 2.2901 7.3430 12.0461 6.2222 6.3019 2.9520 1.8422 0.4332 2.0515 0.7391 1.6213 0.2792 0.9538 6.6952 8.7194 0.1048 0.6284 2.0094 2.9868 9.1647 3.0998 9.2526 8.3232 16.2733 5.8345 1.2411 11.5138 7.8464 16.7019 0.7145 23.5913 15.0720 3.5742 0.5387 11.3912 0.4530 2.8096 32.7604 42.7378 29.8826 16.7765 4.0809 55.8731 41.1279 26.2912 0.2757 1.7360 23.0607 8.1085 0.0218 47.7983 59.0700 11.3529
temp: 298.150 k
press: 1.00000 atm
elementType: 6 6 6 6 6 6 6 6 6 6 6 6 6 6 6 6 6 1 1 1 1 1 1 1 1 1 1 1 1 1 1 1 1
symmnumber: 1
zpe: 721107.6 jmol-1
zpe.correction: 0.274655 hartree
zpe.thermalcorrener: 0.288829 hartree
zpe.thermalcorrenthalpy: 0.289773 hartree
zpe.thermalcorrgfe: 0.234024 hartree
zpe.sumelectzpe: -656.254986 hartree
zpe.sumelectthermal: -656.240812 hartree
zpe.sumelectthermalent: -656.239868 hartree
zpe.sumelectthermalfe: -656.295617 hartree
dipole: 0.2435 0.7478 0.0371
dipole: 0.7873
quadrupole: -89.0855 -87.7971 -107.4602
quadrupole: 0.3060 -1.0025 -1.3768
quadrupole: 5.6954 6.9838 -12.6792 0.3060 -1.0025 -1.3768
hfenergy: -656.529641 hartree
pointgroup: C01 [X(C17H16)]
dipole: 0.057416 0.3039648 0.0158186 debye
polarizability: 273.6391147|-9.2989239|216.7846097|-0.1703496|-5.6814039|85.7554203 unknown
InChI: InChI=1S/C17H16/c1-3-13-12(2)14-8-4-5-10-16(14)17-11-7-6-9-15(13)17/h4-11H,3H2,1-2H3
charge 0 multiplicity 1
33 atoms
C  0.903775 1.330801 -0.240966
C  1.342288 -0.062892 -0.129337
C  -0.458567 1.641787 -0.187355
C  0.376368 -1.128801 -0.01258
C  -1.455334 0.577231 -0.076654
C  -1.050526 -0.804095 -0.004823
C  1.963077 2.420577 -0.390798
C  2.73432 -0.406238 -0.114761
C  -0.967343 3.075785 -0.227979
C  0.845487 -2.47449 0.092009
C  -2.855262 0.88139 -0.053438
C  -2.061022 -1.810975 0.080723
C  2.495994 2.937952 0.972983
C  3.166779 -1.733244 -0.006782
C  2.21156 -2.78093 0.093766
C  -3.825025 -0.124831 0.03278
C  -3.423351 -1.486855 0.09941
H  2.809684 2.044221 -0.992511
H  1.559593 3.271359 -0.965745
H  3.487835 0.382854 -0.18271
H  -1.589577 3.295854 0.660132
H  -0.155232 3.815685 -0.243269
H  -1.600814 3.255438 -1.118047
H  0.128265 -3.295555 0.178398
H  -3.181945 1.923344 -0.108356
H  -1.776949 -2.865905 0.131159
H  1.680073 3.383638 1.57054
H  3.276118 3.708083 0.827496
H  2.930263 2.115226 1.568915
H  4.238085 -1.962597 0.002017
H  2.54166 -3.822146 0.176917
H  -4.889144 0.135801 0.047081
H  -4.17563 -2.280571 0.164388
