program: Gaussian 09
title: 000177751
version: EM64L-G09RevD.01
frameworkgroup: C1[X(C14H12O4)]
method: RPBEPBE
basis: SDD
operation: Freq
keyword: #pfreq=noraman
keyword: PBEPBE/SDD
title: #p freq=noraman PBEPBE/SDD
converged: NO YES NO NO
title: Mulliken charges:
elementType: O O O O C C C C C C C C C C C C C C H H H H H H H H H H H H
charge: -0.265593 -0.208278 -0.241233 -0.186097 0.311227 -0.540895 0.183821 0.071031 0.257238 -0.710873 -0.716662 -0.568638 -0.528723 0.403053 0.203476 -0.257268 -0.309457 0.120007 0.249414 0.253156 0.239497 0.241376 0.224191 0.213753 0.233269 0.238871 0.287238 0.292304 0.254992 0.255801
chargesum: 0.00000
title: Mulliken charges with hydrogens summed into heavy atoms:
elementType: O O O O C C C C C C C C C C C C C C
charge: -0.265593 -0.208278 -0.241233 -0.186097 0.311227 -0.038325 0.183821 0.071031 0.257238 -0.005808 -0.030769 -0.281400 -0.236419 0.403053 0.203476 -0.002276 -0.053655 0.120007
polarizability: 3.00773936e+02 1.08144274e+01 1.61545161e+02 -5.04011125e+00 3.34780246e+00 8.57506504e+01
1716.lowfreq: -14.8400 -6.3986 -3.5739 -0.0009 -0.0006 0.0002 51.3678 65.1779 97.8214
frequency: 51.3365 65.1395 97.8167 121.7677 149.9902 156.8351 175.2843 217.1959 242.1843 255.7080 269.9196 294.3605 306.4768 331.6443 400.7601 415.5920 425.3179 444.2351 452.5487 465.4493 476.3133 514.2079 561.6702 576.2973 615.8689 642.4341 646.9325 701.6230 715.4979 745.1932 755.7040 780.7644 812.6902 828.3338 833.3219 861.6341 877.7133 909.0888 933.1956 939.2380 960.7240 989.1900 1007.9617 1024.9622 1039.7768 1101.6289 1125.5528 1167.2794 1186.3198 1206.2532 1214.8564 1240.7122 1248.0156 1266.1953 1295.2104 1318.5192 1375.9170 1383.9906 1399.1977 1406.6029 1423.7066 1434.6503 1453.8130 1463.8344 1471.7485 1480.7063 1485.9548 1537.4137 1585.6198 1603.8109 1636.6636 1693.9130 2985.3601 2992.6949 2997.6278 3076.8339 3087.9101 3097.5919 3101.1900 3105.1348 3139.5022 3141.5362 3188.9130 3190.1948
redmass: 4.4661 6.2272 4.0899 5.2416 5.2590 5.3873 1.0642 1.1614 3.6983 3.2327 6.5766 4.3278 5.5803 2.6355 3.9202 3.4788 3.5153 5.7092 3.2740 4.5676 5.1479 5.1576 6.5035 4.3150 5.2813 6.1923 3.9942 5.1994 7.7162 5.2651 3.7507 5.9138 6.2361 1.7234 2.7349 3.8756 1.5965 1.8974 1.4191 1.4902 1.9108 1.3429 1.4387 2.8477 3.7429 1.5927 2.4017 1.8644 1.9665 2.9673 1.4641 1.9052 1.9825 2.3273 3.4046 2.0574 2.5980 1.2622 1.2042 5.4952 1.1129 4.8318 1.0607 1.0483 1.0722 3.5059 1.1174 10.1127 9.4073 7.6887 8.2618 10.9358 1.0636 1.0363 1.0365 1.0959 1.0992 1.0998 1.1005 1.1000 1.0913 1.0916 1.0928 1.0956
irintensity: 0.9394 8.5642 2.5125 1.1332 0.5850 2.5359 0.1809 0.9467 1.2133 0.5124 0.8317 1.7648 1.4244 2.7521 7.2866 0.3024 3.9274 1.8687 4.0697 2.1853 22.1993 4.4137 20.6104 12.0923 0.6726 42.9754 1.6193 2.9921 18.2802 6.4867 7.0949 4.3442 15.5371 33.8993 19.5021 64.1741 33.5143 9.6851 2.5885 27.9966 2.9179 1.7313 2.6005 2.1492 180.0452 11.6231 160.8667 30.8131 3.5241 277.4191 74.6469 14.4687 9.9238 14.8929 56.6193 55.6734 88.8188 26.5770 21.2669 41.7604 27.8518 59.4188 5.5689 3.9360 7.3456 31.5029 14.3736 62.7147 465.7830 58.9122 561.1196 422.8738 8.5107 9.6231 16.6115 5.8427 25.4450 18.1828 16.8801 29.5514 4.9833 5.0628 0.5563 1.4374
temp: 298.150 k
press: 1.00000 atm
elementType: 8 8 8 8 6 6 6 6 6 6 6 6 6 6 6 6 6 6 1 1 1 1 1 1 1 1 1 1 1 1
symmnumber: 1
zpe: 594558.8 jmol-1
zpe.correction: 0.226456 hartree
zpe.thermalcorrener: 0.241751 hartree
zpe.thermalcorrenthalpy: 0.242695 hartree
zpe.thermalcorrgfe: 0.184578 hartree
zpe.sumelectzpe: -840.321055 hartree
zpe.sumelectthermal: -840.305759 hartree
zpe.sumelectthermalent: -840.304815 hartree
zpe.sumelectthermalfe: -840.362932 hartree
dipole: 4.7948 1.0685 0.3824
dipole: 4.9273
quadrupole: -109.4495 -113.7660 -103.0272
quadrupole: -25.8809 -0.4490 -0.5929
quadrupole: -0.7020 -5.0184 5.7204 -25.8809 -0.4490 -0.5929
hfenergy: -840.5475106 hartree
pointgroup: C01 [X(C14H12O4)]
dipole: -1.8897749 -0.3906433 0.1847723 debye
polarizability: 301.1252793|8.9971224|161.0363815|2.0643834|-5.5825336|85.9080867 unknown
InChI: InChI=1S/C14H12O4/c1-14(2)7-10(15)9-5-8-3-4-13(16)17-11(8)6-12(9)18-14/h3-6H,7H2,1-2H3
charge 0 multiplicity 1
30 atoms
O  -1.969758 1.43159 -0.276269
O  -2.315335 -2.742959 0.053834
O  2.790565 1.260063 -0.139796
O  5.09852 1.304043 -0.060632
C  -3.302346 0.805039 0.126536
C  -3.389152 -0.610554 -0.487549
C  -0.893115 -0.790591 -0.053155
C  -2.197346 -1.494503 -0.119237
C  -0.834928 0.641013 -0.176801
C  -3.355256 0.783178 1.666616
C  -4.34166 1.757581 -0.472779
C  0.310637 -1.515573 0.066237
C  0.405675 1.311572 -0.213341
C  1.566653 -0.869846 0.045334
C  1.586444 0.559541 -0.106013
C  2.833348 -1.557969 0.158702
C  4.02727 -0.871589 0.128131
C  4.088601 0.580672 -0.021084
H  -4.319364 -1.112831 -0.171145
H  -3.415747 -0.525028 -1.593372
H  -3.231268 1.804199 2.064665
H  -2.566494 0.142233 2.097676
H  -4.331745 0.39183 2.00394
H  -5.361514 1.408474 -0.232441
H  -4.236323 1.811788 -1.569708
H  -4.21421 2.773239 -0.061338
H  0.241865 -2.605791 0.159505
H  0.447133 2.398746 -0.308636
H  2.830537 -2.648183 0.27163
H  4.99191 -1.377382 0.213489
