program: Gaussian 09
title: 000177746
version: EM64L-G09RevD.01
frameworkgroup: C1[X(C15H12N2O)]
method: RPBEPBE
basis: SDD
operation: Freq
keyword: #p
keyword: freq=noraman
keyword: PBEPBE/SDD
title: #p freq=noraman PBEPBE/SDD
converged: YES YES NO NO
title: Mulliken charges:
elementType: O N N C C C C C C C C C C C C C C C H H H H H H H H H H H H
charge: -0.231358 -0.406916 -0.039991 0.040174 -0.671611 0.318588 0.117945 0.341763 0.128354 -0.390384 -0.350174 -0.372962 -0.368346 -0.226429 -0.231398 -0.245774 -0.226414 -0.230254 0.283004 0.266060 0.325737 0.233468 0.255747 0.249954 0.273741 0.232808 0.233244 0.230395 0.229489 0.231544
chargesum: 0.00000
title: Mulliken charges with hydrogens summed into heavy atoms:
elementType: O N N C C C C C C C C C C C C C C C
charge: -0.231358 -0.081179 -0.039991 0.040174 -0.122547 0.318588 0.117945 0.341763 0.128354 -0.156916 -0.094428 -0.123009 -0.094605 0.006378 0.001845 -0.015380 0.003074 0.001289
polarizability: 3.17625056e+02 1.76695752e+01 1.90193870e+02 4.91079676e-01 -5.94268648e-01 8.29064166e+01
1716.lowfreq: -7.9565 -0.0007 -0.0006 0.0003 1.9332 6.3590 42.4089 50.6052 71.8613
frequency: 42.3822 50.6040 71.8592 98.6309 146.1466 178.2339 197.5358 273.2431 320.8781 332.6221 362.0030 376.4305 403.0888 430.4861 450.4072 486.0976 519.9736 549.8517 563.0596 585.6120 611.0448 617.1562 643.2062 661.7945 697.1934 701.8762 735.2297 763.6119 773.6768 777.5628 810.2041 852.9119 856.0153 867.9045 907.3531 938.0427 946.6510 962.2963 981.5391 984.9563 989.5602 1004.7045 1010.7766 1035.5385 1038.5923 1086.4946 1113.0073 1141.3690 1170.1489 1173.1522 1193.1928 1209.3166 1226.0571 1248.7164 1264.7506 1298.5691 1321.1978 1333.2680 1369.7653 1385.0843 1402.3324 1435.5324 1455.5138 1463.6263 1470.3556 1488.7257 1557.6477 1568.3760 1587.2033 1610.5071 1613.7128 1639.7638 2998.6200 3122.0609 3128.2604 3135.6526 3139.4100 3141.6157 3150.5895 3157.7505 3162.1866 3171.7423 3173.4331 3503.1395
redmass: 3.9051 5.3087 5.3514 6.6769 4.7446 5.6998 5.0553 5.8031 4.1991 5.2300 4.3947 5.8412 2.8457 4.2923 3.6807 3.6344 4.2269 3.8128 4.3555 2.6642 4.7437 5.4129 4.8792 4.5860 1.7326 1.8391 4.0990 1.3919 2.0783 3.6159 4.7660 2.2069 1.4198 1.9170 4.4473 1.4721 1.3921 2.4239 1.3245 1.8522 2.8492 1.3475 3.6503 2.0394 2.0267 1.6286 1.8118 1.4165 1.0689 1.0627 1.1212 3.2684 2.4130 1.8937 1.3713 2.6790 1.3443 2.8675 6.3711 8.2085 1.8960 2.2833 2.3769 1.2599 2.3299 2.1512 7.3925 7.2136 6.2098 6.1906 6.4219 5.7264 1.0681 1.0882 1.0851 1.0929 1.0901 1.0879 1.0931 1.0939 1.0962 1.0998 1.1005 1.0756
irintensity: 0.1083 1.2369 1.5141 1.4794 0.5367 1.6808 0.5345 0.2820 1.1911 3.6705 8.9611 1.0537 0.2333 10.4174 0.9000 13.0660 17.5017 2.1818 3.4862 29.1711 0.6391 0.9823 4.7534 12.3325 45.9894 50.4075 2.6297 99.0088 62.8223 6.9164 14.5439 5.8117 0.2181 2.3284 3.6738 3.4119 3.8320 2.1690 0.2579 1.2864 0.3432 0.7129 24.9533 1.3593 12.6489 16.2235 14.2609 12.2122 0.3455 2.8358 14.8154 51.8353 38.3268 22.6100 10.4590 64.6377 3.2537 43.6613 8.8610 0.3727 2.4547 14.6994 16.5345 33.2456 24.0696 21.5335 88.2823 53.5668 8.4953 12.8419 28.2806 349.7156 7.3808 7.8178 0.8693 8.8020 2.8501 5.9973 21.4933 16.8873 20.0069 24.5453 23.3762 28.0931
temp: 298.150 k
press: 1.00000 atm
elementType: 8 7 7 6 6 6 6 6 6 6 6 6 6 6 6 6 6 6 1 1 1 1 1 1 1 1 1 1 1 1
symmnumber: 1
zpe: 612610.0 jmol-1
zpe.correction: 0.233331 hartree
zpe.thermalcorrener: 0.247080 hartree
zpe.thermalcorrenthalpy: 0.248024 hartree
zpe.thermalcorrgfe: 0.192133 hartree
zpe.sumelectzpe: -762.303066 hartree
zpe.sumelectthermal: -762.289317 hartree
zpe.sumelectthermalent: -762.288373 hartree
zpe.sumelectthermalfe: -762.344264 hartree
dipole: -1.4215 -1.6206 0.8195
dipole: 2.3062
quadrupole: -80.4180 -108.0522 -106.7728
quadrupole: -3.6117 1.5386 0.8759
quadrupole: 17.9964 -9.6379 -8.3585 -3.6117 1.5386 0.8759
hfenergy: -762.5363968 hartree
pointgroup: C01 [X(C15H12N2O1)]
dipole: 0.544235 0.6397196 0.3432546 debye
polarizability: 316.8614112|20.1725382|190.8379171|1.5696088|3.6125482|83.0260137 unknown
InChI: InChI=1S/C15H12N2O/c18-15-10-14(11-6-2-1-3-7-11)16-12-8-4-5-9-13(12)17-15/h1-9,17H,10H2
charge 0 multiplicity 1
30 atoms
O  0.06051 -3.260861 -0.364794
N  1.694385 -1.615635 -0.56833
N  0.25607 0.96682 0.047767
C  -0.589839 0.023932 0.413913
C  -0.088235 -1.258758 1.078481
C  2.360963 -0.401482 -0.237604
C  1.653776 0.81233 0.086729
C  -2.04276 0.226789 0.174608
C  0.535487 -2.151205 0.006401
C  3.779523 -0.382188 -0.331094
C  2.422642 1.990473 0.327975
C  -2.966671 -0.853897 0.228249
C  -2.525137 1.528113 -0.147139
C  4.509518 0.791486 -0.077152
C  3.824497 1.985613 0.268289
C  -4.338064 -0.634333 -0.025896
C  -3.894676 1.744693 -0.387946
C  -4.80884 0.663746 -0.3269
H  0.689896 -0.981648 1.816379
H  -0.880541 -1.819151 1.589566
H  2.168047 -2.246366 -1.223526
H  4.304492 -1.310318 -0.589335
H  1.867345 2.908032 0.546008
H  -2.620333 -1.872851 0.430335
H  -1.801876 2.347256 -0.200897
H  5.602143 0.77962 -0.146815
H  4.385219 2.904676 0.466957
H  -5.037043 -1.477077 0.006825
H  -4.25411 2.75234 -0.624376
H  -5.874789 0.832353 -0.51648
