program: Gaussian 09
title: 000177732
version: EM64L-G09RevD.01
frameworkgroup: C1[X(C11H8S2)]
method: RPBEPBE
basis: SDD
operation: Freq
keyword: #pfreq=noraman
keyword: PBEPBE/SDD
title: #p freq=noraman PBEPBE/SDD
converged: NO YES NO NO
title: Mulliken charges:
elementType: S S C C C C C C C C C C C H H H H H H H H
charge: 0.211278 0.238535 -0.060513 -0.082103 -0.287208 -0.295321 -0.267706 -0.214896 -0.134372 -0.513939 0.074486 0.036042 -0.745774 0.252214 0.254014 0.263029 0.246107 0.266530 0.252771 0.253558 0.253269
chargesum: 0.00000
title: Mulliken charges with hydrogens summed into heavy atoms:
elementType: S S C C C C C C C C C C C
charge: 0.211278 0.238535 -0.060513 -0.082103 -0.034994 -0.041307 -0.004677 -0.214896 0.111734 -0.247409 0.074486 0.036042 0.013824
polarizability: 3.54346272e+02 -4.60585804e+00 1.41523180e+02 -2.78161725e-01 -1.93837267e-02 6.00283363e+01
1716.lowfreq: -5.9231 -0.0024 -0.0020 0.0019 1.6345 5.1247 12.2393 27.2036 52.4283
frequency: -5.8796 27.1949 52.4277 58.9045 124.1884 130.6433 208.4368 238.5034 290.1093 296.8421 353.0944 404.7958 438.5288 478.8274 494.3783 538.0743 567.6094 592.4563 602.5873 647.0712 679.3967 687.2999 688.1446 792.1290 815.8175 822.1794 848.0793 901.3221 901.6189 906.2393 1024.4693 1029.0969 1052.9077 1062.5733 1087.9824 1177.2637 1206.1597 1224.8421 1270.6202 1315.8503 1358.5196 1399.9746 1456.5375 1459.1828 1465.9727 1487.7678 1525.3657 1574.7706 2253.3394 2971.6408 3056.6503 3064.5771 3165.3692 3167.1297 3186.3929 3192.0617 3238.3082
redmass: 1.0198 5.7337 6.4455 4.3971 4.8371 5.6876 5.0128 8.8473 4.7411 4.9924 8.4973 6.5911 7.4694 5.4294 6.8844 4.5507 3.3943 3.7575 9.2095 9.2673 7.9869 1.1635 6.9047 5.4915 1.2913 1.3262 5.8914 5.5051 1.4381 1.3691 1.3719 1.4027 1.5954 1.6558 1.1120 2.1335 1.9473 2.8240 1.8276 2.5608 3.1003 1.2318 1.0412 1.0410 7.0936 5.8996 6.3427 7.3457 11.7690 1.0350 1.0984 1.0980 1.0909 1.0909 1.0963 1.0993 1.1002
irintensity: 0.0115 0.1712 3.2183 1.5009 0.4106 1.3266 6.2401 0.8576 3.9374 1.6527 0.1821 0.9847 1.7355 6.9459 0.5197 4.0971 0.4842 0.0547 2.5910 0.6929 1.3704 105.2570 3.8210 38.7954 64.6485 28.8526 4.5458 6.8998 0.1431 0.1991 6.2076 7.0480 3.0080 18.0414 1.5626 8.3805 17.8911 0.1321 1.6298 1.9997 0.4386 0.6441 14.5004 13.6267 10.3906 7.1467 29.0498 0.8812 18.9752 51.0988 12.0059 10.6354 8.6523 12.2773 5.8406 2.3976 0.5737
temp: 298.150 k
press: 1.00000 atm
elementType: 16 16 6 6 6 6 6 6 6 6 6 6 6 1 1 1 1 1 1 1 1
symmnumber: 1
zpe: 389158.5 jmol-1
zpe.correction: 0.148223 hartree
zpe.thermalcorrener: 0.160179 hartree
zpe.thermalcorrenthalpy: 0.161124 hartree
zpe.thermalcorrgfe: 0.108153 hartree
zpe.sumelectzpe: -1219.119567 hartree
zpe.sumelectthermal: -1219.107611 hartree
zpe.sumelectthermalent: -1219.106666 hartree
zpe.sumelectthermalfe: -1219.159637 hartree
dipole: -1.0304 -0.2753 -0.0109
dipole: 1.0666
quadrupole: -61.6620 -82.8539 -96.2368
quadrupole: -1.1239 0.0372 0.0063
quadrupole: 18.5889 -2.6030 -15.9859 -1.1239 0.0372 0.0063
hfenergy: -1219.26779 hartree
pointgroup: C01 [X(C11H8S2)]
dipole: -0.3993866 0.1282767 0.0118479 debye
dipolederiv: -0.1158031 -0.0185976 0.004413 -0.0315995 -0.2235456 -0.0058543 0.0014086 -0.0050664 0.1041374 0.0209028 -0.0673808 -0.0002046 0.1283606 -0.2733068 -0.0113541 0.0049083 -0.0087987 0.1235505 0.1275464 -0.0749701 -0.0032175 0.0361709 0.2007038 0.0060873 -0.0002524 0.0061092 -0.0801234 0.3997668 -0.1276134 -0.0094982 -0.158013 0.242888 0.0113349 -0.0115246 0.010028 -0.1217436 -0.0540696 -0.0484652 -0.0023565 -0.2421531 -0.151526 0.0016106 -0.0065234 0.0019069 -0.1609823 0.0226399 -0.0711038 -0.0042229 -0.1156064 -0.203855 0.0008435 -0.0049208 0.0003298 -0.1705973 -0.1047968 0.0742514 0.0023728 0.2697095 -0.0703186 -0.0006226 0.0050813 -0.0001056 -0.1559714 0.433727 0.0488512 -0.0099716 -0.0349864 0.3035664 0.0080538 -0.0073947 0.0062665 -0.0960808 -0.114806 0.1113171 0.0022746 0.2790957 -0.0836182 -0.0019685 0.007531 -0.0002027 -0.133934 -0.4482929 0.1283031 0.0043851 -0.1272447 0.2434538 0.0152453 -0.0016641 0.0123039 -0.3246914 -0.3469728 0.0136044 0.0074476 -0.0000793 -0.1597157 -0.0044495 0.0038129 -0.0028963 -0.0184433 0.2128666 -0.0805339 -0.0108258 -0.1493264 -0.0818311 0.005259 0.0244661 -0.0014619 -0.1651611 0.0049999 0.0123987 0.0089106 0.1024781 0.0771623 -0.0047451 -0.0462791 0.0047148 0.1000007 0.0334083 0.0857112 0.0035001 0.1000215 0.0174476 -0.0045292 0.003772 -0.0044491 0.1928185 0.0685478 0.0787567 0.0034917 0.1105895 0.0182877 -0.0060033 0.0041971 -0.0053106 0.1974985 0.0457023 -0.0650718 0.0002794 -0.0985959 -0.0032303 -0.0026777 -0.0004209 -0.003432 0.1902267 0.0306549 -0.0663757 0.0003009 -0.1255973 -0.0220641 -0.0038849 -0.0011208 -0.0045146 0.1935909 -0.0007067 0.0202986 0.0032975 -0.0056136 0.0856122 -0.0034417 0.0019266 -0.0036607 0.226434 -0.0894113 0.0561361 -0.0363598 0.0824758 0.0821536 0.0734577 -0.097052 0.085004 -0.043158 -0.0787056 -0.0531501 0.0225145 -0.1019238 -0.0144874 0.0346566 0.0441574 0.0295735 0.1265671 -0.0471978 0.0436339 0.013469 0.0818379 0.0162231 -0.1070178 0.0758915 -0.1163382 0.0160625 unknown
polarizability: 354.2383864|-5.9978532|141.5544755|-3.3270933|1.8549772|60.1049263 unknown
InChI: InChI=1S/C11H8S2/c1-2-4-9-6-7-11(13-9)10-5-3-8-12-10/h3,5-8H,1H3
charge 0 multiplicity 1
21 atoms
S  -0.615274 0.951956 -0.02946
S  3.357267 -1.245801 -0.123002
C  0.669624 -0.329495 -0.067305
C  2.066193 0.039417 -0.075247
C  0.087403 -1.601275 -0.086759
C  2.654409 1.306567 -0.05112
C  -1.341615 -1.601584 -0.070794
C  -1.921337 -0.329705 -0.036934
C  4.092045 1.291351 -0.068797
C  4.632132 0.014885 -0.107539
C  -3.280122 0.044679 -0.012723
C  -4.467719 0.398658 0.008843
C  -5.877047 0.806987 0.035077
H  0.683028 -2.517907 -0.111442
H  2.065788 2.227819 -0.020699
H  -1.947823 -2.509985 -0.082217
H  4.703824 2.196331 -0.053649
H  5.676161 -0.292294 -0.12799
H  -6.188008 1.245417 -0.931803
H  -6.535174 -0.057494 0.239887
H  -6.059155 1.562473 0.822073
