program: Gaussian 09
title: 000177722
version: EM64L-G09RevD.01
frameworkgroup: C1[X(C14H32N2)]
method: RPBEPBE
basis: SDD
operation: Freq
keyword: #pfreq=noraman
keyword: PBEPBE/SDD
title: #p freq=noraman PBEPBE/SDD
converged: YES YES NO NO
title: Mulliken charges:
elementType: N N C C C C C C C C C C C C C C H H H H H H H H H H H H H H H H H H H H H H H H H H H H H H H H
charge: -0.285878 -0.285849 -0.366715 -0.366607 -0.395162 -0.395282 -0.371347 -0.371281 -0.355470 -0.355558 -0.055315 -0.055206 -0.692887 -0.704164 -0.692990 -0.704230 0.191917 0.186442 0.191925 0.186420 0.178097 0.216835 0.178093 0.216841 0.173915 0.208529 0.208555 0.173867 0.197742 0.181095 0.197746 0.181128 0.183167 0.183193 0.232000 0.232001 0.195837 0.203832 0.247658 0.204967 0.215002 0.209886 0.195828 0.203870 0.247680 0.204967 0.215010 0.209895
chargesum: 0.00000
title: Mulliken charges with hydrogens summed into heavy atoms:
elementType: N N C C C C C C C C C C C C C C
charge: -0.053878 -0.053847 0.011644 0.011737 -0.000230 -0.000348 0.011097 0.011141 0.023368 0.023316 0.127852 0.127987 -0.045560 -0.074308 -0.045612 -0.074358
polarizability: 2.25237265e+02 -1.01403788e+00 1.47745813e+02 8.52633308e-03 -1.02643986e-02 1.42017039e+02
1716.lowfreq: -0.0020 0.0012 0.0015 2.9171 4.5857 15.5423 21.6736 27.7707 29.2909
frequency: 15.5557 25.9526 28.2589 37.0176 60.7129 69.6828 72.4843 106.2032 108.0437 120.4299 137.0366 142.6427 151.7310 164.3527 166.0806 200.3084 204.9896 206.7779 229.5564 239.6227 269.9182 291.1271 332.3815 350.8611 386.8315 401.2678 422.3696 458.5967 463.6844 519.3497 522.5983 688.8948 691.3012 729.3626 751.8102 799.2265 822.7384 823.0394 879.3434 908.6928 912.3647 918.8208 919.3719 939.9048 940.6697 964.7328 964.8585 976.0007 998.8037 1002.0812 1034.1980 1041.8060 1071.3665 1079.4672 1083.8293 1101.9907 1117.9102 1138.7851 1142.9086 1145.2285 1146.3487 1179.9252 1182.3031 1184.5493 1199.9136 1218.5416 1222.9525 1238.3304 1255.0236 1268.8726 1272.8406 1274.6888 1288.8706 1289.8088 1294.3296 1301.4384 1324.3653 1332.6408 1333.3765 1343.6851 1351.7066 1358.6025 1370.8073 1370.9518 1382.6497 1383.7174 1395.3425 1395.6640 1450.6315 1451.1521 1463.5901 1463.8182 1464.5485 1465.6896 1468.5428 1468.7049 1470.8363 1478.8412 1479.2361 1479.9461 1482.6544 1485.9842 1489.7170 1489.7840 1495.9788 1496.8930 2834.1909 2834.2900 2844.1870 2844.2824 2942.3671 2942.4025 2952.7794 2953.3102 2955.9276 2964.0520 2966.5214 2966.5579 2970.2104 2970.2583 2990.4359 2990.5072 2991.8510 2992.6440 2992.9071 3011.8452 3035.2528 3046.9602 3056.9605 3056.9867 3063.8152 3063.8329 3070.2075 3070.2114 3087.4570 3087.4854 3411.9613 3412.0440
redmass: 3.7775 3.6816 2.3679 3.6140 3.6506 1.6903 3.2652 1.7086 3.0162 2.5374 2.9907 1.9698 3.1912 2.0301 2.3890 1.6816 1.0804 1.2358 1.1115 1.2711 3.1103 2.7452 2.6477 2.6153 2.5056 2.2889 2.1263 2.4962 3.0151 3.4342 2.9970 1.2801 1.2719 1.0679 1.0963 1.1590 2.6395 2.6479 1.2300 1.3172 1.2862 1.2504 1.2874 1.5746 1.5479 1.6537 1.6354 1.5148 2.2896 3.8058 2.6670 2.9852 2.4850 2.1589 2.2148 1.3883 1.5955 2.3865 2.2868 3.6139 3.6270 1.8727 1.7671 1.7693 1.9897 1.4393 1.3665 1.3169 1.2745 1.1999 1.2375 1.0544 1.1012 1.1766 1.1920 1.3373 1.3767 1.4321 1.4299 1.4186 1.4936 1.6534 1.2374 1.2347 1.3776 1.3781 1.2875 1.3013 1.2010 1.2029 1.0629 1.0581 1.0703 1.0652 1.0504 1.0503 1.0845 1.0664 1.0484 1.0717 1.0877 1.0907 1.0558 1.0558 1.0858 1.0886 1.0715 1.0715 1.0708 1.0708 1.0821 1.0821 1.0626 1.0595 1.0649 1.0625 1.0357 1.0357 1.0367 1.0367 1.0878 1.0881 1.0960 1.0843 1.0834 1.0993 1.1009 1.1029 1.0993 1.0993 1.0988 1.0988 1.0990 1.0990 1.0992 1.0992 1.0736 1.0736
irintensity: 0.0004 0.0387 0.0915 0.0668 0.2408 0.8351 0.0041 0.2987 1.5779 0.0943 0.1873 3.0466 0.0061 0.9193 3.6272 0.0046 0.4343 0.4619 0.6472 0.0070 0.4239 0.6398 1.0735 0.3096 2.5893 3.8643 1.4359 3.4639 0.1502 1.8196 0.8002 32.0958 145.2118 13.6807 0.9129 0.8510 0.7467 1.6713 1.9230 0.0939 1.7306 1.5537 12.6876 2.4325 1.2443 7.4648 1.2742 0.0479 0.2948 2.8816 5.6979 0.1735 9.5302 0.0217 0.0718 63.8013 0.4746 31.8443 0.1707 88.9422 0.0382 0.3012 0.7605 26.9733 0.4388 1.9028 6.1443 2.6641 0.1181 0.6168 0.1112 1.5917 0.1211 1.5253 9.7980 0.0757 2.8013 2.3669 3.2121 0.1085 7.3994 0.2121 30.6543 20.1162 0.2493 29.8957 6.4935 8.2025 64.0536 4.3716 6.0402 1.8314 4.4681 0.0120 0.0579 0.0542 0.0106 14.7444 17.8064 5.5712 0.7882 2.7797 16.9410 19.4586 0.1389 15.8081 94.4708 6.9984 208.8302 167.0596 20.3909 20.7189 2.8989 3.0656 3.0539 107.2117 43.5521 34.8333 43.1156 26.9986 11.1161 4.9341 0.0970 76.5471 80.2759 0.0593 0.9817 178.3897 16.0230 16.2889 58.2416 103.5876 95.2686 23.0141 43.3803 9.4452 2.5020 2.6326
temp: 298.150 k
press: 1.00000 atm
elementType: 7 7 6 6 6 6 6 6 6 6 6 6 6 6 6 6 1 1 1 1 1 1 1 1 1 1 1 1 1 1 1 1 1 1 1 1 1 1 1 1 1 1 1 1 1 1 1 1
symmnumber: 1
zpe: 1157862.1 jmol-1
zpe.correction: 0.441006 hartree
zpe.thermalcorrener: 0.463166 hartree
zpe.thermalcorrenthalpy: 0.464110 hartree
zpe.thermalcorrgfe: 0.386809 hartree
zpe.sumelectzpe: -660.799958 hartree
zpe.sumelectthermal: -660.777798 hartree
zpe.sumelectthermalent: -660.776854 hartree
zpe.sumelectthermalfe: -660.854155 hartree
dipole: 0.0016 -0.0050 -1.9221
dipole: 1.9221
quadrupole: -107.8558 -105.2892 -103.9813
quadrupole: -2.9481 0.0099 0.0033
quadrupole: -2.1470 0.4196 1.7275 -2.9481 0.0099 0.0033
hfenergy: -661.2409642 hartree
pointgroup: C01 [X(C14H32N2)]
dipole: -0.0008109 0.0026585 -0.7562122 debye
polarizability: 225.2291634|-1.2865185|147.7538794|-0.0312375|0.0159323|142.0170731 unknown
InChI: InChI=1S/C14H32N2/c1-13(2)11-15-9-7-5-6-8-10-16-12-14(3)4/h13-16H,5-12H2,1-4H3
charge 0 multiplicity 1
48 atoms
N  -4.442342 -0.168436 -0.180792
N  4.442373 0.171113 -0.18105
C  -0.618209 0.465486 -0.168672
C  0.618046 -0.461644 -0.171268
C  -1.955123 -0.308593 -0.166329
C  1.955095 0.312154 -0.165118
C  -3.188339 0.615665 -0.177365
C  3.187996 -0.612438 -0.181907
C  -5.685336 0.633412 -0.19246
C  5.684853 -0.631425 -0.199824
C  -6.944777 -0.262018 -0.081136
C  6.945052 0.262189 -0.082554
C  -6.995564 -0.985192 1.283692
C  -8.223986 0.569899 -0.329136
C  6.998427 0.973079 1.288638
C  8.22329 -0.568358 -0.339921
H  -0.575765 1.128696 0.720309
H  -0.577302 1.131611 -1.056059
H  0.575727 -1.129561 0.714186
H  0.576865 -1.12307 -1.062156
H  -1.990179 -0.9766 -1.054095
H  -2.014307 -0.964904 0.723712
H  1.989988 0.985148 -1.049115
H  2.014814 0.963394 0.72861
H  -3.113073 1.317615 -1.049013
H  -3.183357 1.246789 0.734262
H  3.182986 -1.248963 0.725958
H  3.112259 -1.309165 -1.057701
H  -5.655101 1.32227 0.676919
H  -5.774403 1.276956 -1.1062
H  5.65486 -1.32695 0.664231
H  5.772737 -1.267937 -1.11858
H  -6.876441 -1.033701 -0.880091
H  6.87595 1.041014 -0.874476
H  -4.443331 -0.858577 -0.947051
H  4.442904 0.866519 -0.94254
H  -7.172876 -0.257095 2.099435
H  -7.811202 -1.731641 1.31297
H  -6.035971 -1.493256 1.482076
H  -8.313236 1.381002 0.419687
H  -9.128424 -0.060871 -0.248446
H  -8.219398 1.034544 -1.333412
H  7.177181 0.237623 2.097446
H  7.814204 1.719154 1.323196
H  6.039255 1.479443 1.493313
H  8.312848 -1.386385 0.40129
H  9.128325 0.060943 -0.254638
H  8.217009 -1.023738 -1.348422
