program: Gaussian 09
title: 000177651
version: EM64L-G09RevD.01
frameworkgroup: C1[X(C13H8Cl4)]
method: RPBEPBE
basis: SDD
operation: Freq
keyword: #pfreq=noraman
keyword: PBEPBE/SDD
title: #p freq=noraman PBEPBE/SDD
converged: NO YES NO NO
title: Mulliken charges:
elementType: Cl Cl Cl Cl C C C C C C C C C C C C C H H H H H H H H
charge: 0.027634 0.040490 0.004487 0.050536 0.275538 0.440496 -0.352207 -0.352349 0.434329 -0.347521 -0.391584 -0.374362 -0.373358 -0.025734 -0.080220 -0.103429 -0.804265 0.243359 0.243354 0.285250 0.233385 0.233363 0.226560 0.226500 0.239748
chargesum: 0.00000
title: Mulliken charges with hydrogens summed into heavy atoms:
elementType: Cl Cl Cl Cl C C C C C C C C C C C C C
charge: 0.027634 0.040490 0.004487 0.050536 0.275538 0.440496 -0.108849 -0.108995 0.434329 -0.347521 -0.106335 -0.140977 -0.139994 -0.025734 -0.080220 -0.103429 -0.111457
polarizability: 2.64082426e+02 -6.24231514e+00 1.68383654e+02 1.30557207e-02 2.58787833e-02 1.09990646e+02
1716.lowfreq: -38.0865 -3.1997 0.0018 0.0030 0.0031 2.5624 6.6490 21.4863 41.8626
frequency: -38.0641 21.0244 41.8427 42.9708 77.1809 86.7081 151.0902 174.4141 198.0296 204.4877 210.2095 236.1856 257.2124 317.3999 323.3441 327.8618 337.6682 399.2829 400.5923 469.9069 489.1008 536.8673 550.6586 584.3498 614.0677 638.4935 647.4384 726.1216 737.2216 766.2633 784.6608 825.0251 834.2580 847.3379 884.2494 951.8705 971.6704 986.5579 1004.5951 1020.9738 1046.8793 1098.9480 1121.0785 1167.8098 1193.6959 1221.9735 1267.7020 1304.2819 1320.1209 1341.5852 1356.1283 1396.7667 1400.6520 1400.9446 1469.7484 1473.0300 1507.3241 1526.3560 1572.0036 1574.6914 1623.5992 2976.5863 3058.1458 3086.5520 3121.4553 3122.9639 3145.1950 3150.7154 3172.2971
redmass: 3.7347 1.0302 9.3224 5.8506 31.5906 9.6523 4.5987 13.0615 25.8505 7.7042 34.5365 12.0267 6.1132 24.0932 4.9303 3.1675 27.9639 3.2495 4.6156 3.6841 9.5197 5.4910 8.1589 3.6323 8.5810 8.2600 8.2913 3.2601 5.7295 6.2522 5.7539 1.6183 7.6535 1.2470 1.4497 1.3120 1.3806 1.4039 6.0056 3.7063 1.5700 5.1419 1.3200 1.8650 1.1066 2.9111 4.3916 1.2958 5.5785 9.0194 4.9934 1.2297 3.2289 3.9786 1.0925 1.0544 2.9657 10.1687 8.2137 6.0163 6.4933 1.0385 1.0951 1.0999 1.0878 1.0879 1.0962 1.0975 1.0930
irintensity: 0.0421 0.5662 0.0181 0.2843 0.0180 0.0172 0.3289 0.3337 0.0519 0.1074 0.0031 0.1656 1.3046 0.3539 2.4597 0.3215 0.2046 0.0000 0.0008 4.0648 15.0702 2.6648 11.8211 28.8676 0.1152 42.2156 0.1607 1.3828 1.4879 39.1557 27.9102 19.3149 3.0968 0.0005 14.8452 0.1442 0.0160 0.3981 13.1463 13.5312 18.4155 9.4260 10.7081 38.0264 4.5140 2.4215 30.2911 0.5072 55.1207 19.1533 0.1007 18.5237 2.6239 124.4363 14.3877 12.8296 20.0347 21.8277 1.5519 0.2492 4.5822 34.2263 21.1507 17.3870 5.1401 22.8802 27.8908 0.2395 0.1335
temp: 298.150 k
press: 1.00000 atm
elementType: 17 17 17 17 6 6 6 6 6 6 6 6 6 6 6 6 6 1 1 1 1 1 1 1 1
symmnumber: 1
zpe: 436029.4 jmol-1
zpe.correction: 0.166075 hartree
zpe.thermalcorrener: 0.181636 hartree
zpe.thermalcorrenthalpy: 0.182580 hartree
zpe.thermalcorrgfe: 0.120387 hartree
zpe.sumelectzpe: -2339.226523 hartree
zpe.sumelectthermal: -2339.210963 hartree
zpe.sumelectthermalent: -2339.210019 hartree
zpe.sumelectthermalfe: -2339.272211 hartree
dipole: -3.7039 -1.0346 -0.0011
dipole: 3.8456
quadrupole: -115.3878 -130.3592 -120.7597
quadrupole: 2.6313 0.0068 0.0069
quadrupole: 6.7811 -8.1903 1.4092 2.6313 0.0068 0.0069
hfenergy: -2339.3925983 hartree
pointgroup: C01 [X(C13H8Cl4)]
dipole: 1.4668967 -0.3706256 0.0004168 debye
dipolederiv: -0.2358023 -0.2548691 -0.0000193 -0.2973398 -0.5368653 -0.0000193 0.0000188 -0.0000098 -0.0106022 -0.2544658 0.2927749 0.0000065 0.3429621 -0.4846474 -0.0000173 0.0000049 -0.0000024 0.0013384 -0.2357941 -0.2564378 -0.0000022 -0.3367361 -0.6365617 -0.0000101 -0.0000161 -0.0000111 -0.023197 -0.7377182 -0.0530825 -0.0000353 -0.0272485 -0.012297 -0.0000025 -0.0000449 -0.0000015 0.0077669 0.1827006 -0.0506282 -0.0000156 -0.0422188 -0.0824005 -0.0000404 0.0002123 0.0000015 -0.0178907 0.4570665 -0.0871402 -0.0000274 -0.1035731 -0.0599359 0.0000509 -0.0000077 0.0000197 -0.0352497 -0.1130409 0.0076145 0.0495787 -0.0128715 -0.0997479 -0.0165988 -0.0841733 0.0042625 0.0731071 -0.1134039 0.007656 -0.0494648 -0.0132772 -0.0998476 0.016294 0.0841268 -0.0045031 0.0730701 0.4811621 0.0146348 0.0003367 0.0897008 -0.0268703 -0.0000061 0.0008399 -0.0000121 -0.0341871 0.0731939 0.4510409 0.0000367 0.5527553 0.6341908 0.0000423 -0.0000497 0.0000048 -0.046258 -0.2495143 -0.079772 -0.0000074 -0.0714374 -0.1790915 0.0000183 0.0000127 0.0000115 -0.0819669 -0.1937428 0.0039908 -0.0732843 0.0048137 -0.1563905 -0.0053933 -0.1339375 -0.0052295 0.0680699 -0.1937052 0.0039562 0.073301 0.0046898 -0.1564954 0.0051723 0.1338467 0.0049353 0.0683241 0.1037137 -0.4956993 -0.0000326 -0.5668876 0.5923524 0.0000109 -0.0000645 0.0000119 -0.0034208 0.1026865 0.4105313 -0.0000201 0.4270321 0.9388873 0.0000063 0.0000778 0.0000106 -0.032513 0.9500125 0.0521648 0.0000732 0.0559005 -0.3015728 -0.0000014 0.0000739 0.0000021 -0.0435615 -0.1776828 -0.0115541 -0.0003325 -0.1337499 0.0635712 -0.0000966 -0.002016 0.000012 0.0800543 0.0521648 -0.0016465 -0.0933777 0.000069 0.1289442 0.0043893 -0.1025754 0.0027828 -0.0313649 0.0521637 -0.0017861 0.0934257 -0.0000608 0.128951 -0.0041381 0.1025651 -0.002571 -0.0313811 0.0793196 0.0392905 -0.000005 0.0602262 0.0302232 -0.0000084 -0.0000019 0.0000083 0.1418061 -0.0129821 0.0077305 0.0984737 0.0065829 0.1437888 -0.0045778 0.1016708 -0.0016105 -0.0541565 -0.0128475 0.0078353 -0.0983981 0.0067484 0.1437218 0.0048499 -0.1016792 0.0018866 -0.0541905 0.0174161 0.022274 -0.0236914 0.0826491 0.0592038 0.0797396 -0.1086544 0.1007597 -0.062726 0.0180948 0.0217625 0.0237616 0.081164 0.0613331 -0.0783533 0.1101924 -0.0992431 -0.0651094 -0.0389951 -0.0506411 -0.00028 -0.1098932 -0.0924438 -0.0013104 -0.0004216 -0.0015154 0.1142386 unknown
polarizability: 263.7122291|8.6172418|168.7538515|0.0136962|-0.0255456|109.9906456 unknown
InChI: InChI=1S/C13H8Cl4/c1-7-2-4-8(5-3-7)9-6-10(14)12(16)13(17)11(9)15/h2-6H,1H3
charge 0 multiplicity 1
25 atoms
Cl -0.189555 2.669513 0.00009
Cl -3.409936 2.573162 0.00011
Cl -3.188694 -3.008856 0.00003
Cl -4.93678 -0.2637 -0.000093
C  1.220946 -0.114016 -0.000038
C  -0.279575 -0.115818 -0.000008
C  1.941795 -0.130359 -1.219955
C  1.941823 -0.132132 1.219882
C  4.084402 -0.168464 -0.000086
C  -1.045275 1.078079 0.000073
C  -0.972377 -1.349974 0.000005
C  3.353156 -0.158107 -1.215769
C  3.353139 -0.159853 1.215652
C  -2.460997 1.041794 0.000082
C  -2.378045 -1.393854 0.000037
C  -3.137924 -0.203077 0.000015
C  5.603156 -0.161728 0.000033
H  1.397879 -0.119945 -2.171254
H  1.397889 -0.123091 2.171188
H  -0.40218 -2.282716 -0.000044
H  3.894323 -0.17218 -2.169674
H  3.894319 -0.175291 2.169535
H  6.011338 -0.670529 0.890975
H  6.011414 -0.659155 -0.897229
H  5.992858 0.874798 0.006745
