program: Gaussian 09
title: 000177591
version: EM64L-G09RevD.01
frameworkgroup: C1[X(C3H8OS2)]
method: RPBEPBE
basis: SDD
operation: Freq
keyword: #pfreq=noraman
keyword: PBEPBE/SDD
title: #p freq=noraman PBEPBE/SDD
converged: NO YES NO NO
title: Mulliken charges:
elementType: S S O C C C H H H H H H H H
charge: -0.044956 -0.026976 -0.395052 -0.296447 -0.377771 -0.690164 0.254998 0.250803 0.243038 0.246711 0.280116 0.097404 0.358861 0.099436
chargesum: 0.00000
title: Mulliken charges with hydrogens summed into heavy atoms:
elementType: S S O C C C
charge: 0.052448 0.072460 -0.036191 0.209353 -0.134733 -0.163337
polarizability: 8.52550795e+01 3.63202351e+00 6.81781453e+01 -4.77058229e+00 -3.53386892e+00 5.16793331e+01
1716.lowfreq: -28.7905 -6.1559 -4.1541 -0.0024 0.0012 0.0014 31.6471 64.5009 101.2060
frequency: 16.2501 64.3755 101.1774 147.9102 150.5130 224.7495 301.6624 355.9160 387.2998 446.4471 576.7564 704.8073 788.8871 814.1926 834.9859 984.2563 996.6376 1033.5121 1087.6647 1126.5162 1224.6078 1259.1990 1262.9093 1290.2589 1329.7314 1375.1610 1457.3546 1466.4646 2428.5947 2437.3719 2991.4522 3005.5692 3022.8556 3067.6758 3107.8348 3561.3345
redmass: 1.1634 3.2813 1.9723 2.2232 1.8887 3.6733 1.5693 2.8304 3.1922 4.2895 3.5063 5.3841 1.1184 1.2240 1.1706 1.8851 3.0892 2.1613 2.2187 1.1695 1.2632 1.1746 1.2224 1.1213 1.3214 1.5817 1.0750 1.0957 1.0388 1.0385 1.0860 1.0609 1.0588 1.1006 1.1073 1.0659
irintensity: 21.3658 5.0226 11.4578 4.8509 13.6890 4.3752 132.8950 49.6038 24.7837 18.7870 26.9738 12.4093 9.8389 20.8551 2.0109 66.1226 109.2539 10.1703 0.0831 16.9772 4.2560 43.8682 33.2155 15.9490 21.4763 17.5999 4.4519 9.4179 24.8663 35.8627 35.3665 6.3998 30.6036 7.6660 19.3869 8.5553
temp: 298.150 k
press: 1.00000 atm
elementType: 16 16 8 6 6 6 1 1 1 1 1 1 1 1
symmnumber: 1
zpe: 271749.0 jmol-1
zpe.correction: 0.103504 hartree
zpe.thermalcorrener: 0.112705 hartree
zpe.thermalcorrenthalpy: 0.113649 hartree
zpe.thermalcorrgfe: 0.067162 hartree
zpe.sumelectzpe: -989.925016 hartree
zpe.sumelectthermal: -989.915815 hartree
zpe.sumelectthermalent: -989.914870 hartree
zpe.sumelectthermalfe: -989.961357 hartree
dipole: -1.6807 -1.2379 3.0648
dipole: 3.7081
quadrupole: -49.4099 -55.1471 -52.1554
quadrupole: -4.1589 -2.9340 -1.4964
quadrupole: 2.8276 -2.9097 0.0821 -4.1589 -2.9340 -1.4964
hfenergy: -990.0285193 hartree
pointgroup: C01 [X(C3H8O1S2)]
dipole: 0.633429 -0.6457132 -1.144641 debye
dipolederiv: -0.3387061 0.0842202 -0.1310772 -0.0261596 -0.5880727 0.08005 -0.12351 0.1433008 0.0883834 -0.2538997 0.076431 0.0304235 0.04658 0.0674796 0.1788883 0.0051644 0.179592 -0.1710975 -0.5587243 -0.4293492 -0.0947829 -0.317603 -0.8776049 0.0933655 -0.1360564 0.0214019 -0.4798724 -0.1560293 -0.0626846 0.0099961 0.1903092 -0.0409826 -0.0281077 0.0941048 0.0086015 0.0453229 0.7167956 0.1101294 0.1166184 -0.018901 1.242505 -0.1431837 0.0494614 -0.0229728 0.3493217 0.3909842 -0.1115218 -0.0944022 -0.0104367 0.004438 -0.0430311 -0.0460228 -0.0476884 0.1451204 0.0850334 -0.004299 -0.0018719 -0.0201456 0.0982864 -0.0022848 -0.0140251 -0.0168394 -0.0820789 0.0610296 0.0753187 -0.0166067 0.0182153 -0.0736599 0.0548799 -0.0046364 0.0436654 0.0847054 -0.0258305 0.0289689 -0.0242364 0.0252445 -0.1061755 -0.0164618 -0.0323469 -0.0037961 -0.1935224 -0.0461786 0.0228057 0.0763595 0.0138829 0.0704231 -0.0274722 0.0354943 -0.0372297 -0.1563171 -0.0013366 0.0695748 0.0152939 0.0268554 -0.0754379 0.0271735 0.0294586 0.0334966 0.0616898 0.0903414 0.0664474 0.0631446 0.0521843 0.0371956 0.0238918 0.1086866 -0.0577862 -0.1389337 0.0797319 0.1008912 0.0462791 0.1391756 0.326864 -0.0679407 0.0729884 -0.1025838 0.3493053 -0.043211 -0.0269327 0.0048622 -0.1192013 -0.0852581 -0.1297669 -0.0387608 -0.1411617 0.0979733 unknown
polarizability: 84.5040143|-5.663849|69.6088632|-3.2340022|2.4446393|50.9996804 unknown
InChI: InChI=1S/C3H8OS2/c4-3(6)1-2-5/h3-6H,1-2H2
charge 0 multiplicity 1
14 atoms
S  1.724301 -1.474005 0.457758
S  -3.040063 0.169478 0.167194
O  1.982791 1.307875 0.12394
C  -0.277437 0.544873 0.151356
C  1.145479 0.212056 -0.30756
C  -1.326633 -0.431035 -0.401408
H  -0.307201 0.559688 1.256332
H  -0.493261 1.574444 -0.19406
H  1.192474 0.060228 -1.404255
H  -1.314119 -0.447406 -1.505232
H  -1.157391 -1.447158 -0.012022
H  2.278227 -1.984652 -0.706053
H  2.937749 1.083661 -0.017037
H  -3.751315 -0.911247 -0.328954
