program: Gaussian 09
title: 000177594
version: EM64L-G09RevD.01
frameworkgroup: C1[X(C10H7Cl2NO2)]
method: RPBEPBE
basis: SDD
operation: Freq
keyword: #p
keyword: freq=noraman
keyword: PBEPBE/SDD
title: #p freq=noraman PBEPBE/SDD
converged: YES YES NO NO
title: Mulliken charges:
elementType: Cl Cl O O N C C C C C C C C C C H H H H H H H
charge: -0.015517 -0.030849 -0.185009 -0.174871 -0.339584 -0.503669 -0.502299 0.151571 0.164505 0.662492 -0.274339 -0.298643 -0.210833 -0.215756 -0.103124 0.265802 0.269200 0.270674 0.265888 0.256488 0.283804 0.264069
chargesum: 0.00000
title: Mulliken charges with hydrogens summed into heavy atoms:
elementType: Cl Cl O O N C C C C C C C C C C
charge: -0.015517 -0.030849 -0.185009 -0.174871 -0.339584 0.031334 0.034262 0.151571 0.164505 0.662492 -0.274339 -0.042155 0.072971 0.048313 -0.103124
polarizability: 1.91586461e+02 7.00094735e+00 1.27295312e+02 -3.29432574e+00 -2.14071923e+00 8.79236317e+01
1716.lowfreq: -2.8769 -0.0039 -0.0036 -0.0034 0.3631 6.1224 31.5240 51.4201 70.2506
frequency: 31.3974 51.4134 70.2445 80.5758 115.9272 144.7953 165.0858 175.3750 228.7607 284.0276 348.3240 371.5382 392.7578 445.6261 469.8415 514.7743 534.6693 535.5641 567.9282 601.9129 617.4135 649.8007 662.2680 711.9958 760.1172 813.2295 825.2900 866.6835 911.5216 948.8037 1008.5079 1014.8774 1020.9408 1039.6965 1082.9257 1138.3615 1144.9126 1151.5772 1174.3301 1211.6249 1247.4090 1268.1984 1295.1537 1345.3289 1361.5543 1380.9565 1438.5886 1454.0734 1468.4421 1573.2710 1594.7547 1647.9217 1708.7252 3027.7347 3036.0889 3082.2695 3099.1994 3164.9107 3184.9882 3187.0952
redmass: 8.4163 8.4102 4.1150 1.9886 12.6879 7.7908 7.1804 16.6073 13.4218 9.0637 6.5901 11.6069 10.1463 3.3520 4.1587 8.3615 4.4531 3.8780 4.0535 2.9067 9.7105 5.8084 7.2025 4.0301 8.6637 1.3929 1.5552 1.4185 7.3933 1.3897 2.4062 4.4440 2.4752 3.3322 2.6972 1.5693 1.3025 4.0212 3.9875 1.1244 1.3530 1.5776 1.5002 4.3099 5.6692 5.0699 1.0711 1.1031 3.0175 8.6552 7.5388 12.5495 12.5840 1.0598 1.0645 1.1021 1.1012 1.0895 1.0947 1.0963
irintensity: 0.5700 0.6095 4.3709 1.2085 6.6154 2.5121 0.0835 0.9254 1.3995 0.0685 0.1434 7.0459 22.4721 7.3118 2.5481 9.4672 0.7485 0.7792 8.8226 5.4548 4.5624 52.4487 3.7428 8.2213 56.9211 14.0157 21.5443 20.4587 44.9050 1.7900 1.3607 1.1447 16.1648 21.8376 40.9722 39.9392 22.6848 222.4409 82.9147 0.5602 5.2707 0.4025 0.0631 170.4256 4.0581 20.3674 1.7622 54.0464 197.3761 25.7786 23.5717 526.8068 4.3673 11.6888 1.4703 0.5182 6.1776 1.7826 0.1452 1.6853
temp: 298.150 k
press: 1.00000 atm
elementType: 17 17 8 8 7 6 6 6 6 6 6 6 6 6 6 1 1 1 1 1 1 1
symmnumber: 1
zpe: 391490.4 jmol-1
zpe.correction: 0.149111 hartree
zpe.thermalcorrener: 0.162500 hartree
zpe.thermalcorrenthalpy: 0.163444 hartree
zpe.thermalcorrgfe: 0.106994 hartree
zpe.sumelectzpe: -1509.541690 hartree
zpe.sumelectthermal: -1509.528301 hartree
zpe.sumelectthermalent: -1509.527356 hartree
zpe.sumelectthermalfe: -1509.583806 hartree
dipole: 2.7713 -1.1701 0.4220
dipole: 3.0377
quadrupole: -83.9429 -101.1133 -108.8671
quadrupole: -1.1961 0.3264 -12.0469
quadrupole: 14.0315 -3.1389 -10.8927 -1.1961 0.3264 -12.0469
hfenergy: -1509.6908004 hartree
pointgroup: C01 [X(C10H7Cl2N1O2)]
dipole: 1.0991485 0.3713754 -0.2867858 debye
dipolederiv: -0.264986 0.1808152 -0.1746503 0.2019797 -0.3281476 0.2585281 -0.1740698 0.2662595 -0.2663006 -0.8945965 0.0281856 -0.0295204 0.0005416 -0.0954791 0.0342695 -0.006258 0.0313053 -0.0787863 -0.5159466 0.1861229 0.124626 -0.0848099 -0.9484083 -0.3501104 -0.0640181 -0.3458557 -0.4849018 -0.5130776 -0.1839577 -0.1351453 0.0712759 -0.8506073 -0.3887595 0.0482097 -0.3660889 -0.545583 -1.1603493 -0.0312635 0.0189481 -0.0334921 -1.2012257 -0.5782312 0.0005305 -0.5593651 -0.476911 -0.3981859 0.0675993 0.0413609 -0.042871 0.0089163 -0.0480761 0.035605 -0.0394306 0.0888378 -0.3968403 -0.0565565 -0.0656882 0.0647927 0.0181623 -0.0468863 -0.0773979 -0.0524621 0.0694217 1.0761885 0.2681558 0.1251604 0.5343219 1.4392362 0.6769369 0.2088646 0.6753112 0.532271 1.0726804 -0.2504416 -0.1152937 -0.5021817 1.2979805 0.7770407 -0.1751636 0.6638926 0.6411329 0.6962914 0.1174225 -0.1019041 0.0423339 -0.1296449 0.0118798 -0.0675945 0.0372213 -0.0177553 0.3654284 -0.3292641 0.2846638 -0.2458819 0.4683323 -0.4411194 0.1776473 -0.4250453 0.3571074 0.0510882 -0.0011714 0.0330668 0.0011474 0.0202923 -0.068488 0.0758954 -0.0409882 -0.0360706 -0.4861086 0.1598027 -0.1329402 0.1104007 -0.1460771 0.0819947 -0.1089504 0.0872155 -0.1295086 -0.4071843 -0.0830959 0.0464846 -0.0667151 -0.0566237 -0.0330905 0.0598908 -0.0274115 -0.0810271 1.3487651 -0.0245611 0.0338077 -0.0051699 0.1305664 -0.1427157 0.0239283 -0.1495236 0.0540981 0.0560806 -0.0409933 0.0295253 -0.0291856 -0.009992 0.0406318 0.0743024 0.0659479 0.0566027 0.0740439 -0.004812 -0.0484033 0.0336449 0.0836273 -0.0123678 -0.0761726 -0.0343547 -0.0314816 0.0770595 0.0221954 -0.0176529 0.0171345 -0.0067393 0.0423734 -0.065598 0.0684728 0.0527543 0.057654 0.0053629 0.0619833 -0.0297126 0.0831051 -0.0193673 0.0880384 -0.0368863 -0.0258963 0.0378351 -0.0497743 0.0377392 -0.0518879 0.0579107 0.0700074 0.0401877 0.0510831 0.0895733 0.0740682 -0.0225181 0.0191722 -0.0276345 0.0933357 0.0602721 0.0176977 0.0581316 0.1220627 0.050092 0.0427472 -0.0353399 0.041969 0.07148 0.0752777 -0.0355748 0.0725712 0.1103605 unknown
polarizability: 191.2808971|-6.5471753|122.5656561|6.1410398|-13.3361356|92.9588513 unknown
InChI: InChI=1S/C10H7Cl2NO2/c11-6-1-2-8(7(12)5-6)13-9(14)3-4-10(13)15/h1-2,5H,3-4H2
charge 0 multiplicity 1
22 atoms
Cl -0.1310 -1.995621 1.688769
Cl -4.892204 0.165574 -0.134837
O  1.500752 2.235377 0.971323
O  1.491864 -1.872802 -1.315733
N  1.168446 0.151966 -0.117684
C  3.431357 0.821225 0.253221
C  3.425659 -0.57079 -0.417703
C  1.959812 1.201201 0.441908
C  1.956224 -0.894053 -0.698007
C  -0.265101 0.153112 -0.110745
C  -0.997874 -0.790671 0.648483
C  -0.973747 1.119371 -0.860887
C  -2.405488 -0.804914 0.643959
C  -2.383027 1.139545 -0.871325
C  -3.075316 0.16753 -0.123284
H  3.918622 1.595771 -0.364137
H  3.929544 0.834206 1.237116
H  3.834058 -1.361384 0.235828
H  3.990194 -0.610504 -1.363864
H  -0.410452 1.859838 -1.435944
H  -2.957594 -1.544198 1.228748
H  -2.92733 1.889121 -1.451005
