program: Gaussian 09
title: 000177596
version: EM64L-G09RevD.01
frameworkgroup: C1[X(C14H13NO3)]
method: RPBEPBE
basis: SDD
operation: Freq
keyword: #p
keyword: freq=noraman
keyword: PBEPBE/SDD
title: #p freq=noraman PBEPBE/SDD
converged: YES YES NO NO
title: Mulliken charges:
elementType: O O O N C C C C C C C C C C C C C C H H H H H H H H H H H H H
charge: -0.272266 -0.243879 -0.196818 -0.585470 0.095029 0.412319 0.315851 -0.569257 0.197765 -0.703032 -0.702755 -0.599054 0.400600 -0.514981 0.194816 -0.268373 -0.311268 0.113638 0.278733 0.240938 0.230727 0.210556 0.230604 0.210682 0.240866 0.255599 0.274329 0.274234 0.290128 0.246717 0.253023
chargesum: 0.00000
title: Mulliken charges with hydrogens summed into heavy atoms:
elementType: O O O N C C C C C C C C C C C C C C
charge: -0.272266 -0.243879 -0.196818 -0.036908 0.095029 0.412319 0.315851 -0.290524 0.197765 -0.020811 -0.020603 -0.343455 0.400600 -0.224854 0.194816 -0.021656 -0.058245 0.113638
polarizability: 3.16341166e+02 -3.89649581e+00 1.56573152e+02 1.35754936e-03 -6.61323786e-03 8.85280500e+01
1716.lowfreq: 0.0003 0.0004 0.0009 3.2008 3.5922 7.2934 43.1441 48.3348 95.2199
frequency: 42.9124 48.2692 95.2197 107.4017 130.8860 184.6542 210.1617 218.2826 240.5720 259.4441 263.1123 301.3622 314.2634 326.4243 370.1737 378.1067 407.8159 410.6321 442.1928 460.4675 463.5517 486.2786 530.8847 534.8026 590.1245 610.3302 642.4056 667.5430 699.2798 712.7279 739.3930 749.9701 780.4520 816.5872 822.0390 832.6847 837.5340 867.1747 871.2351 890.1293 897.4072 931.6986 987.6455 988.6514 990.3033 1035.2857 1037.0128 1045.6315 1080.8859 1146.8471 1165.5529 1202.6627 1212.8138 1226.3701 1242.3072 1253.4372 1282.0457 1294.8073 1373.2843 1374.7872 1391.1197 1407.4818 1454.4361 1458.6403 1465.2565 1465.3799 1473.3856 1485.8732 1568.7222 1580.4110 1609.2138 1631.3543 1635.7653 1686.0915 2987.1985 2989.6824 3083.2622 3087.8404 3108.6972 3113.6184 3131.6027 3143.9257 3186.6690 3192.9850 3232.2473 3460.2931 3595.7502
redmass: 3.8080 4.9536 6.0158 4.4274 4.8964 5.0621 1.0666 3.0603 4.0523 1.2712 4.4140 1.8839 3.1096 1.7857 3.5626 3.2688 4.9143 3.0820 3.0314 4.4461 3.8077 2.5350 2.9280 3.3068 6.9639 3.6707 3.8548 4.6562 7.6103 6.2977 6.2893 3.4083 7.0669 6.6523 1.3958 3.4605 1.4886 1.4946 3.2354 5.1825 1.5678 1.6340 1.3224 1.8104 1.2379 1.5005 3.4005 2.7594 3.7757 1.5147 1.8901 2.3673 2.0680 1.9812 1.6183 3.7595 2.2611 4.0833 1.1961 2.4513 1.2089 4.3136 5.0135 1.0526 5.1476 1.0512 1.0648 1.0664 8.7007 8.0184 7.3404 1.1182 7.4998 10.7421 1.0358 1.0366 1.0988 1.0976 1.1016 1.1008 1.0905 1.0926 1.0955 1.0940 1.0977 1.0441 1.0991
irintensity: 1.8130 0.3099 0.8090 0.2041 1.1910 0.7214 2.1194 2.5657 1.2406 0.1089 0.1480 35.0619 6.1128 12.0369 2.0972 5.3287 7.7517 4.6512 7.1734 31.1458 2.2616 174.8881 121.6367 56.7228 23.9328 62.4179 0.0034 5.6579 27.9571 0.6272 1.5879 6.5892 4.0333 5.1339 36.8136 16.6812 0.9141 30.0529 49.7623 28.0832 68.5157 2.0799 0.7664 10.1766 0.5367 0.0569 42.9745 129.7754 142.5545 11.3050 4.2246 37.5971 31.5338 18.6904 7.8251 37.2223 6.8905 78.7877 21.2923 14.0320 14.1826 22.5927 11.4156 6.4080 54.2858 1.2507 8.6325 13.1115 45.6676 66.2270 1.3166 42.0652 134.2606 591.5901 36.5446 10.9238 15.0831 43.3042 0.1490 49.2463 10.2868 6.8017 2.8254 1.0761 6.1271 5.4660 0.9989
temp: 298.150 k
press: 1.00000 atm
elementType: 8 8 8 7 6 6 6 6 6 6 6 6 6 6 6 6 6 6 1 1 1 1 1 1 1 1 1 1 1 1 1
symmnumber: 1
zpe: 626567.0 jmol-1
zpe.correction: 0.238647 hartree
zpe.thermalcorrener: 0.254413 hartree
zpe.thermalcorrenthalpy: 0.255357 hartree
zpe.thermalcorrgfe: 0.196134 hartree
zpe.sumelectzpe: -820.426712 hartree
zpe.sumelectthermal: -820.410946 hartree
zpe.sumelectthermalent: -820.410002 hartree
zpe.sumelectthermalfe: -820.469224 hartree
dipole: -4.6946 5.1195 0.0042
dipole: 6.9461
quadrupole: -127.5758 -97.1823 -105.3629
quadrupole: 15.5152 -0.0601 -0.0013
quadrupole: -17.5355 12.8580 4.6774 15.5152 -0.0601 -0.0013
hfenergy: -820.6653588 hartree
pointgroup: C01 [X(C14H13N1O3)]
dipole: -1.8396748 1.9510487 -0.5265043 debye
polarizability: 316.2309569|-3.263329|152.4880771|5.2581576|-16.2114599|92.7233338 unknown
InChI: InChI=1S/C14H13NO3/c1-14(2,15)12-6-9-5-8-3-4-13(16)18-10(8)7-11(9)17-12/h3-7H,15H2,1-2H3
charge 0 multiplicity 1
31 atoms
O  -1.78746 -0.965046 0.273945
O  3.080827 -1.18561 0.424157
O  5.385489 -1.286823 0.497126
N  -4.961969 1.027005 -0.292425
C  -4.16065 -0.168949 0.027273
C  -2.666481 0.134552 -0.019596
C  -0.523199 0.92835 -0.178702
C  -1.933659 1.2724 -0.292857
C  -0.481582 -0.462093 0.172185
C  -4.542175 -0.648887 1.454446
C  -4.491636 -1.275632 -1.010995
C  0.692178 1.620861 -0.330112
C  1.915129 0.923114 -0.130593
C  0.691399 -1.192557 0.379259
C  1.89283 -0.471884 0.220731
C  3.212021 1.553951 -0.264661
C  4.381595 0.855742 -0.06477
C  4.3939 -0.561827 0.293951
H  -2.34824 2.245186 -0.545496
H  -5.617238 -0.894842 1.473771
H  -3.956109 -1.538947 1.738344
H  -4.34863 0.143222 2.201781
H  -3.904717 -2.187802 -0.811255
H  -4.260334 -0.935996 -2.037868
H  -5.567734 -1.510817 -0.952695
H  0.714517 2.6827 -0.598278
H  -4.91838 1.777418 0.403111
H  -4.878817 1.359906 -1.257352
H  0.700986 -2.250749 0.646905
H  3.250547 2.616529 -0.533108
H  5.363689 1.324629 -0.163924
