program: Gaussian 09
title: 000177587
version: EM64L-G09RevD.01
frameworkgroup: C1[X(C13H8ClN3S)]
method: RPBEPBE
basis: SDD
operation: Freq
keyword: #p
keyword: freq=noraman
keyword: PBEPBE/SDD
title: #p freq=noraman PBEPBE/SDD
converged: YES YES NO NO
title: Mulliken charges:
elementType: Cl S N N N C C C C C C C C C C C C C H H H H H H H H
charge: -0.037348 0.231967 -0.073832 -0.071814 0.003557 0.489979 -0.323016 0.443929 -0.304053 -0.340261 -0.351839 -0.264658 -0.207602 -0.208231 -0.107755 -0.449288 -0.178926 -0.332226 0.287811 0.240086 0.290087 0.262617 0.261117 0.250105 0.238878 0.250717
chargesum: 0.00000
title: Mulliken charges with hydrogens summed into heavy atoms:
elementType: Cl S N N N C C C C C C C C C C C C C
charge: -0.037348 0.231967 -0.073832 -0.071814 0.003557 0.489979 -0.323016 0.443929 -0.304053 -0.052450 -0.111754 0.025429 0.055015 0.052887 -0.107755 -0.199184 0.059952 -0.081509
polarizability: 4.25617205e+02 1.42486623e+00 1.70655163e+02 -3.42534038e-04 -4.90938103e-02 6.80622541e+01
1716.lowfreq: -2.0075 -0.0019 -0.0008 0.0014 1.8114 6.7721 31.5653 33.6340 52.3406
frequency: 31.5371 33.5732 52.2926 56.3684 84.4636 142.8893 158.1255 192.8964 249.2615 261.0016 323.8279 344.6660 359.4816 387.4327 404.3725 412.3725 461.0939 492.8296 511.4594 600.7575 604.2437 610.6049 612.6783 625.9385 659.1834 696.8774 713.0129 717.7396 746.3489 824.8373 826.4867 846.7121 915.9209 917.4491 940.5450 956.2605 957.7741 986.3880 999.3400 1003.5884 1005.0318 1019.3386 1034.0083 1074.4468 1112.9649 1116.7605 1183.3291 1189.5320 1206.2795 1255.7966 1297.6708 1312.3400 1336.3118 1361.7435 1388.9390 1401.7094 1419.8267 1429.0229 1481.1001 1493.7034 1542.5545 1572.1165 1580.9631 1599.3600 3114.6628 3138.9153 3139.7384 3159.4590 3161.7037 3174.6415 3177.5518 3180.4227
redmass: 8.8281 4.0578 8.8455 8.7148 8.0657 7.7197 5.8010 9.5136 6.1125 8.2588 11.5690 5.1651 6.3679 3.3907 2.8997 9.7889 4.6273 8.5978 4.0177 10.0641 6.7142 8.6916 8.3186 8.9336 9.3901 7.9344 1.9331 3.5450 8.5924 1.4590 1.4445 1.4443 1.4511 9.8074 8.4924 1.4575 1.3808 1.3572 3.9579 3.9792 1.3738 9.0474 2.9057 2.7730 1.5684 1.4558 2.3695 1.1440 1.7799 4.0749 1.2612 10.5879 1.3326 5.0873 2.2978 4.1439 3.5287 2.4461 3.7138 3.5945 5.4735 7.6105 5.8638 6.1583 1.0912 1.0900 1.0889 1.0925 1.0890 1.0957 1.1000 1.0979
irintensity: 0.2733 1.4043 3.6519 0.1271 0.5706 5.2021 0.7888 1.2530 0.2183 3.4426 0.5583 0.3482 3.3875 3.4096 0.0235 9.2954 5.2749 27.3262 11.5584 4.8022 10.1558 1.2634 5.5795 0.0205 25.7287 8.3012 35.1367 5.3425 17.6838 1.2457 49.1618 58.5000 2.8643 17.7466 4.2508 1.1619 0.5638 1.0831 47.0064 12.6342 1.0538 25.8936 1.5157 74.7238 0.6430 13.4640 1.1910 7.6826 7.5733 4.5964 4.1224 5.9480 16.3725 12.0452 22.3824 77.5003 153.1769 31.1024 0.4442 7.7748 6.3269 7.9698 7.9171 84.8336 22.9735 6.1967 4.8085 16.4430 0.3790 1.8659 16.7577 2.8027
temp: 298.150 k
press: 1.00000 atm
elementType: 17 16 7 7 7 6 6 6 6 6 6 6 6 6 6 6 6 6 1 1 1 1 1 1 1 1
symmnumber: 1
zpe: 468843.9 jmol-1
zpe.correction: 0.178573 hartree
zpe.thermalcorrener: 0.193330 hartree
zpe.thermalcorrenthalpy: 0.194274 hartree
zpe.thermalcorrgfe: 0.134150 hartree
zpe.sumelectzpe: -1521.301547 hartree
zpe.sumelectthermal: -1521.286790 hartree
zpe.sumelectthermalent: -1521.285846 hartree
zpe.sumelectthermalfe: -1521.345970 hartree
dipole: 0.5484 -0.1097 0.0029
dipole: 0.5592
quadrupole: -112.3284 -117.4048 -122.0119
quadrupole: 10.4292 0.0132 -0.0797
quadrupole: 4.9200 -0.1565 -4.7635 10.4292 0.0132 -0.0797
hfenergy: -1521.4801204 hartree
pointgroup: C01 [X(C13H8Cl1N3S1)]
dipole: -0.216017 0.0417499 -0.0020412 debye
dipolederiv: -1.1614022 -0.0898824 0.0199717 -0.1242921 -0.1229316 0.0084672 0.0245435 0.008245 -0.0575004 -0.3876181 -0.0059756 0.004183 0.0323944 -0.4251287 0.0613812 -0.000379 0.0613034 0.093849 -0.5724681 0.1616469 -0.0158092 -0.5371128 -0.3571142 0.0276117 0.0664759 0.0230013 -0.1586322 -0.2796334 -0.1738415 0.0216445 0.3385983 -0.3432375 0.0197539 -0.0393275 0.0228336 -0.1575838 -0.6280711 -0.0153742 0.0042779 -0.0882758 -0.2923948 0.005967 0.0120988 0.0053735 -0.2473444 -0.3286607 0.0016316 0.003107 0.1017243 -0.0712308 0.0107606 -0.0085876 0.0111923 0.0272128 1.1473623 -0.1208016 0.0053892 0.0636829 0.4650748 -0.0556741 -0.0156653 -0.0533916 0.0080113 -0.0204619 0.0088373 -0.0008375 -0.2268297 -0.1664669 0.0293033 0.0273839 0.0274776 0.0663975 0.7655208 0.124361 -0.0201156 0.1080268 0.4491924 -0.0530367 -0.018529 -0.0533576 0.0067943 0.0978843 0.0862535 -0.0116198 -0.2163569 0.0438127 -0.0146804 0.022612 -0.0175534 -0.1029627 0.2062267 -0.0441906 0.0012328 0.1756436 0.0084617 -0.016491 -0.0245568 -0.015216 -0.1311075 0.0077461 -0.0654408 0.0072879 0.1240549 0.09839 -0.0225815 -0.0145511 -0.0211828 -0.0828104 -0.3994866 -0.1732779 0.021915 -0.2772543 -0.0346336 -0.0046122 0.0334023 -0.0053642 -0.0973703 -0.6195367 0.0635164 -0.0023506 0.2652944 0.0290728 -0.0162677 -0.0236793 -0.0145275 -0.0965626 1.5652877 0.1338611 -0.0301726 0.078124 0.1854179 -0.0285092 -0.0249491 -0.0288432 -0.0607042 0.2499061 -0.0107948 -0.0003575 0.0640244 0.1725676 -0.027225 -0.0082517 -0.0270049 -0.0546339 -0.1177907 0.1560975 -0.0183697 0.3204005 -0.0575158 -0.0072135 -0.0385042 -0.0057726 -0.0989639 0.301469 0.015049 -0.0035653 -0.0792768 0.1725224 -0.0275032 0.0071742 -0.0279141 -0.0613763 0.1169008 -0.0637897 0.0075143 -0.0387867 0.0325185 0.0138566 0.0043955 0.0143155 0.1544972 0.0211253 0.0967401 -0.0093115 0.1008181 0.0312333 0.0123859 -0.0095658 0.0127878 0.1525467 0.143343 0.0625573 -0.0073924 0.0422666 0.0252254 0.0141385 -0.00481 0.0139403 0.1457526 0.0141259 0.0672555 -0.0060838 0.0683584 0.0250383 0.0148022 -0.0061538 0.0148055 0.1626965 0.0516107 -0.047135 0.006237 -0.061422 -0.0055718 0.0194622 0.0080881 0.0192946 0.1641514 -0.0176292 -0.0930815 0.0117493 -0.142759 0.0495051 0.0104253 0.0173316 0.0103515 0.1296372 -0.0274723 -0.0843437 0.0111286 -0.1242868 -0.0030904 0.0198746 0.0157117 0.0196833 0.1563178 -0.1282777 0.0101221 0.0003472 0.0332414 0.0912835 0.0056044 -0.0017072 0.0055228 0.1396882 unknown
polarizability: 425.567126|2.8007473|169.3449245|-2.9963701|-11.6512903|69.4225714 unknown
InChI: InChI=1S/C13H8ClN3S/c14-11-5-3-9(4-6-11)12-16-17-13(18-12)10-2-1-7-15-8-10/h1-8H
charge 0 multiplicity 1
26 atoms
Cl 6.876076 0.477609 -0.084385
S  -0.38895 1.085301 -0.095699
N  0.256948 -1.490387 0.201779
N  -1.133442 -1.46239 0.207329
N  -4.95348 1.626841 -0.129594
C  2.275765 -0.07204 0.020856
C  0.828031 -0.286195 0.056454
C  -3.093004 0.033066 0.046341
C  -1.655566 -0.235937 0.067505
C  3.141295 -1.198406 0.137757
C  2.845139 1.22205 -0.126878
C  -4.017753 -1.042291 0.178784
C  4.538252 -1.035745 0.106416
C  4.243211 1.395738 -0.159602
C  5.071698 0.26172 -0.042671
C  -3.622135 1.345855 -0.103923
C  -5.396423 -0.762547 0.154368
C  -5.821782 0.579001 -0.001814
H  2.699804 -2.192591 0.252202
H  2.20011 2.103507 -0.217002
H  -3.63603 -2.060731 0.296293
H  5.202255 -1.899911 0.195924
H  4.679102 2.392015 -0.2734
H  -2.954092 2.210474 -0.209159
H  -6.133918 -1.564696 0.253632
H  -6.88651 0.83589 -0.025914
