program: Gaussian 09
title: 000177585
version: EM64L-G09RevD.01
frameworkgroup: C1[X(C13H9N3S)]
method: RPBEPBE
basis: SDD
operation: Freq
keyword: #p
keyword: freq=noraman
keyword: PBEPBE/SDD
title: #p freq=noraman PBEPBE/SDD
converged: YES YES NO NO
title: Mulliken charges:
elementType: S N N N C C C C C C C C C C C C C H H H H H H H H H
charge: 0.227158 -0.075382 -0.073912 0.002532 0.464532 -0.313779 0.444631 -0.307343 -0.348496 -0.359479 -0.265808 -0.220171 -0.229098 -0.450265 -0.229665 -0.179903 -0.333365 0.281814 0.233760 0.290036 0.235262 0.233565 0.250181 0.235761 0.237851 0.249584
chargesum: 0.00000
title: Mulliken charges with hydrogens summed into heavy atoms:
elementType: S N N N C C C C C C C C C C C C C
charge: 0.227158 -0.075382 -0.073912 0.002532 0.464532 -0.313779 0.444631 -0.307343 -0.066682 -0.125719 0.024228 0.015091 0.004467 -0.200084 0.006095 0.057948 -0.083780
polarizability: 3.72707301e+02 -2.50376684e+00 1.68640986e+02 -1.66665240e-02 2.93833805e-02 6.55948693e+01
1716.lowfreq: -5.0137 -0.0024 -0.0023 -0.0021 1.4498 6.9585 33.3076 40.8128 52.2393
frequency: 33.2908 40.7657 52.1849 69.8487 119.5327 163.1816 194.9302 224.1865 317.6055 342.1069 346.8459 386.1211 398.3958 445.2772 446.7166 508.6494 598.4031 608.4682 610.1720 610.5918 616.7410 641.4523 674.5172 693.7199 713.4863 741.7037 778.0281 825.5361 853.1832 916.3883 918.2269 938.6054 941.4277 955.5542 987.0083 987.8931 1003.4760 1004.6917 1006.4187 1017.1895 1026.8688 1034.8542 1088.9647 1113.8898 1175.6977 1183.5703 1193.2691 1205.9139 1255.9157 1312.3986 1322.2957 1336.0550 1381.5665 1388.5685 1413.5243 1428.7078 1442.5302 1480.7814 1496.4824 1542.7128 1581.1758 1582.3046 1610.2776 3115.7423 3127.3498 3136.5565 3138.8357 3149.8197 3158.9217 3163.9189 3174.4557 3177.1462
redmass: 4.0389 5.8622 9.9270 5.9970 5.0882 5.9635 4.8080 6.6593 4.9419 8.6169 8.9770 3.2004 2.8173 8.6188 4.6063 4.8182 10.4332 5.9458 8.6235 6.9232 9.0288 8.6866 8.0894 1.8060 1.9170 8.6847 1.7999 1.6078 1.2544 1.4458 9.8003 1.4252 8.4849 1.4706 1.3808 6.2753 4.0107 1.3744 1.3368 8.5253 2.3089 2.5979 1.6354 1.6620 1.0570 2.3685 1.1250 1.7946 4.0225 10.5755 1.3479 1.3326 6.6646 2.2998 3.5130 2.4580 2.4446 3.7040 3.2007 5.4869 5.8508 5.9658 5.9948 1.0911 1.0871 1.0878 1.0889 1.0926 1.0925 1.0965 1.1002 1.0999
irintensity: 1.0612 2.7389 2.3150 0.9215 0.2143 5.5766 0.2055 0.1731 0.0023 2.6774 2.5183 2.4405 0.0201 0.0500 0.6223 2.3836 0.0883 13.5069 0.0936 4.4972 3.5675 50.5238 4.1679 49.1142 39.6270 2.4173 53.5322 40.6753 0.1455 2.4788 9.4887 5.0166 5.3616 1.7878 0.3351 1.5859 15.0446 0.9270 0.6878 27.6887 4.9995 2.6051 4.7292 8.2561 0.0428 0.3826 8.5960 8.3283 4.7225 4.7677 7.8016 16.6655 0.7816 23.7093 140.1743 26.9349 27.6916 1.9718 4.3327 6.6555 8.4041 0.8787 5.2230 22.8336 6.2896 1.6508 5.1170 19.2287 16.8351 16.7134 22.8860 15.9787
temp: 298.150 k
press: 1.00000 atm
elementType: 16 7 7 7 6 6 6 6 6 6 6 6 6 6 6 6 6 1 1 1 1 1 1 1 1 1
symmnumber: 1
zpe: 494497.9 jmol-1
zpe.correction: 0.188344 hartree
zpe.thermalcorrener: 0.201782 hartree
zpe.thermalcorrenthalpy: 0.202726 hartree
zpe.thermalcorrgfe: 0.146153 hartree
zpe.sumelectzpe: -1061.912036 hartree
zpe.sumelectthermal: -1061.898598 hartree
zpe.sumelectthermalent: -1061.897654 hartree
zpe.sumelectthermalfe: -1061.954227 hartree
dipole: 1.7332 -0.3803 0.0129
dipole: 1.7745
quadrupole: -80.4057 -106.3034 -110.5477
quadrupole: -13.0110 -0.0126 0.0541
quadrupole: 18.6799 -7.2178 -11.4621 -13.0110 -0.0126 0.0541
hfenergy: -1062.1003799 hartree
pointgroup: C01 [X(C13H9N3S1)]
dipole: -0.6809148 -0.1526168 -0.0210078 debye
dipolederiv: -0.3782096 0.0035889 0.0005332 0.0359778 -0.4301921 -0.0574784 0.0037757 -0.0569908 0.0920897 -0.581003 0.1560171 0.0172166 -0.526851 -0.3680296 -0.0228684 -0.0577265 -0.0232118 -0.1596049 -0.2295033 -0.1718449 -0.0188157 0.2853515 -0.3396807 -0.0202202 0.0317649 -0.019773 -0.1589651 -0.5965866 -0.0195808 -0.0012079 -0.0905769 -0.29689 -0.0048117 -0.0071924 -0.0048299 -0.2478756 -0.2639683 -0.0007386 -0.0004286 0.0929302 -0.031292 -0.0071408 0.0099378 -0.0069079 0.0329546 1.0914629 -0.1146343 -0.0125145 0.0858813 0.4683645 0.0509557 0.0089696 0.0504553 0.0087607 0.030123 0.0082109 0.0016458 -0.2301331 -0.1722497 -0.0253914 -0.0244494 -0.0251691 0.0686036 0.7036766 0.1336855 0.0141724 0.1678179 0.4520943 0.0496399 0.0177906 0.0494064 0.0027288 -0.0506732 0.1001418 0.0108143 -0.1538669 0.0276629 0.0150127 -0.0162685 0.0153003 -0.1130461 0.0777458 -0.0750825 -0.0071902 0.0889635 -0.0339032 0.0110673 0.0110574 0.01129 -0.1418723 -0.0058736 -0.0642004 -0.0072699 0.103316 0.0996937 0.019431 0.0101194 0.0198131 -0.0844737 -0.0040586 -0.164415 -0.0170521 -0.2155961 0.0334959 0.0185873 -0.0223758 0.0185133 -0.1430339 -0.2483872 0.0966816 0.0102348 0.2548328 0.1216961 0.0282722 0.0263529 0.0282288 -0.1432118 0.2277461 -0.0093267 -0.0025599 0.0884648 0.1748473 0.0234877 0.0062025 0.024446 -0.0570737 0.0531222 0.0186951 0.0025859 -0.0715825 -0.0049995 0.0148488 -0.0070273 0.0147594 -0.1439323 -0.1224195 0.1509334 0.0160109 0.3073606 -0.0423046 0.005711 0.0338251 0.0053703 -0.1008324 0.2946088 0.0188499 0.0000636 -0.0784532 0.1675943 0.0249573 -0.0096377 0.0243224 -0.0644945 0.1298887 -0.0648155 -0.0069342 -0.0418295 0.0128687 -0.0150339 -0.00424 -0.0151711 0.1546664 0.022742 0.1058408 0.0107772 0.1092328 0.0270199 -0.0130292 0.0109943 -0.0132214 0.1526492 0.1379285 0.0654191 0.0069755 0.0437026 0.0266664 -0.0126558 0.0041265 -0.0127787 0.1459785 -0.0293412 0.0897113 0.0092072 0.1205012 -0.0271439 -0.0192716 0.0123527 -0.019272 0.1554011 0.0362903 -0.054886 -0.0059346 -0.1019232 -0.0803802 -0.025269 -0.0110646 -0.0252122 0.1571304 -0.0109225 -0.0952629 -0.0093992 -0.1411286 0.0423999 -0.0087047 -0.0134272 -0.0095037 0.1300776 -0.131708 -0.0317086 -0.0038347 -0.0348561 0.0919326 -0.0073595 -0.0041582 -0.0073933 0.1607566 -0.0217081 -0.0860469 -0.0086035 -0.1252847 -0.0108576 -0.0174852 -0.0125374 -0.0176469 0.1567756 -0.1309722 0.0047677 0.0015077 0.0277488 0.0915864 -0.005251 0.0028355 -0.0048234 0.1398436 unknown
polarizability: 372.6667222|3.806855|167.537421|0.2523435|10.7995551|66.7390138 unknown
InChI: InChI=1S/C13H9N3S/c1-2-5-10(6-3-1)12-15-16-13(17-12)11-7-4-8-14-9-11/h1-9H
charge 0 multiplicity 1
26 atoms
S  0.027824 -1.125001 -0.076825
N  -0.685766 1.435003 0.201682
N  0.705653 1.443218 0.201516
N  4.606194 -1.544575 -0.123099
C  -2.668872 -0.04192 0.041249
C  -1.227027 0.215958 0.068997
C  2.702804 -0.000763 0.043947
C  1.258206 0.229163 0.069722
C  -3.5673 1.058615 0.155902
C  -3.195906 -1.35516 -0.09703
C  3.59829 1.101082 0.157236
C  -4.958046 0.842131 0.13082
C  -4.589749 -1.564884 -0.121558
C  3.267474 -1.300113 -0.092433
C  -5.476289 -0.468338 -0.008142
C  4.98412 0.859465 0.127898
C  5.445759 -0.471569 -0.014304
H  -3.152481 2.065428 0.262545
H  -2.518695 -2.213144 -0.185207
H  3.188931 2.109922 0.264145
H  -5.640561 1.694149 0.219333
H  -4.983834 -2.580975 -0.228784
H  2.622912 -2.184027 -0.181878
H  -6.559087 -0.632962 -0.027536
H  5.699545 1.683048 0.212517
H  6.517102 -0.699051 -0.042314
