program: Gaussian 09
title: 000177559
version: EM64L-G09RevD.01
frameworkgroup: C1[X(C12H10)]
method: RPBEPBE
basis: SDD
operation: Freq
keyword: #p
keyword: freq=noraman
keyword: PBEPBE/SDD
title: #p freq=noraman PBEPBE/SDD
converged: NO NO NO NO
title: Mulliken charges:
elementType: C C C C C C C C C C C C H H H H H H H H H H
charge: -0.171890 -0.549662 -0.549662 0.322176 0.322175 0.487018 -0.432437 -0.432439 -0.440190 -0.440186 -0.218082 -0.218086 0.233588 0.233617 0.233615 0.233589 0.239281 0.239283 0.235558 0.235556 0.218588 0.218589
chargesum: 0.00000
title: Mulliken charges with hydrogens summed into heavy atoms:
elementType: C C C C C C C C C C C C
charge: -0.171890 -0.082457 -0.082457 0.322176 0.322175 0.487018 -0.193156 -0.193156 -0.204632 -0.204631 0.000505 0.000503
polarizability: 1.70188991e+02 2.55176790e-05 1.46740058e+02 -3.25798901e-03 -5.44733559e-04 5.74326792e+01
1716.lowfreq: -0.0007 -0.0004 -0.0003 11.1783 13.1229 13.7285 87.3374 168.7116 215.2518
frequency: 87.3319 168.7110 215.2493 231.1075 411.8791 440.9014 441.2586 468.1574 497.2386 538.9016 554.1762 626.5082 627.6288 648.6591 756.0904 760.4383 795.2605 796.4416 818.1579 855.2178 886.9625 916.9194 941.6087 970.8202 982.3739 999.3974 1011.5604 1020.9907 1046.7376 1090.7713 1143.2694 1172.3000 1181.6939 1202.3224 1213.5741 1220.7531 1245.1313 1257.5469 1288.5674 1377.4548 1391.1895 1414.9751 1443.0704 1461.3956 1468.3549 1470.4935 1508.5538 1600.0146 1605.8746 1630.0945 2991.8520 3004.6930 3036.8235 3058.7913 3117.3925 3117.6033 3131.6987 3132.1931 3150.1292 3151.6314
redmass: 1.7776 3.9217 3.1089 3.2181 4.2787 3.7467 3.4154 3.2223 7.3433 6.7394 2.6004 5.3896 3.1036 5.9321 1.8829 1.1800 5.2108 1.3741 4.6838 2.2281 1.3279 1.4610 3.4954 1.3373 1.3637 4.6192 1.9565 2.9549 1.9125 2.8066 1.1760 1.1938 1.2224 1.1007 1.4996 1.2415 1.8295 2.2511 1.8622 2.7316 4.7118 1.8584 1.1659 1.9594 2.6722 1.8237 4.1649 6.3488 8.0500 7.8139 1.0589 1.0614 1.1031 1.1027 1.0856 1.0855 1.0924 1.0918 1.0988 1.0982
irintensity: 0.0000 2.0267 13.6896 0.0000 1.6374 1.0876 0.0000 0.0427 0.0715 1.1120 0.4468 0.0004 0.0000 3.7964 14.2181 0.0000 0.0622 89.5343 2.0215 48.1378 0.0000 0.0115 2.5987 0.0000 4.6103 1.9636 0.0000 6.7805 0.3251 1.1775 0.5783 0.2441 1.8469 0.0001 2.1919 0.6376 3.6862 0.8343 3.3580 23.4173 0.9395 0.1818 4.4921 7.8444 1.1949 6.3851 4.1988 10.3051 18.9245 11.3952 19.7134 51.3353 0.0008 33.7594 1.0541 1.3089 4.2440 38.0061 64.4804 15.4509
temp: 298.150 k
press: 1.00000 atm
elementType: 6 6 6 6 6 6 6 6 6 6 6 6 1 1 1 1 1 1 1 1 1 1
symmnumber: 1
zpe: 471310.1 jmol-1
zpe.correction: 0.179513 hartree
zpe.thermalcorrener: 0.187973 hartree
zpe.thermalcorrenthalpy: 0.188917 hartree
zpe.thermalcorrgfe: 0.146051 hartree
zpe.sumelectzpe: -462.473342 hartree
zpe.sumelectthermal: -462.464882 hartree
zpe.sumelectthermalent: -462.463938 hartree
zpe.sumelectthermalfe: -462.506804 hartree
dipole: 0.0000 -1.0173 0.0000
dipole: 1.0173
quadrupole: -62.7328 -60.3739 -74.6312
quadrupole: 0.0000 -0.0006 -0.0001
quadrupole: 3.1798 5.5387 -8.7186 0.0000 -0.0006 -0.0001
hfenergy: -462.652855 hartree
pointgroup: C01 [X(C12H10)]
dipole: 0.0000228 -0.4002528 0.000008 debye
dipolederiv: -0.0733958 0.0000132 0.0000127 0.0000103 -0.276898 0.0000014 -0.0000331 0.0000017 -0.0397324 0.044016 0.04445 0.000077 -0.0771356 -0.0901694 -0.0001156 0.0000184 -0.0005007 0.1586952 0.0440199 -0.0444338 0.0000786 0.0771483 -0.0901675 0.0001199 0.0000162 0.0005092 0.1586956 0.0086223 0.0936032 0.0000176 -0.0178193 0.3441897 0.0001204 0.0000275 0.0003794 -0.0295876 0.0086356 -0.0936353 0.0000191 0.0177892 0.3441765 -0.000125 0.0000321 -0.0003887 -0.0295867 0.2777496 0.000019 0.0000084 0.0000187 -0.1078819 -0.0000013 0.0000189 0.0000015 0.0964379 0.0028508 -0.2135089 -0.0000353 -0.0716572 -0.1563438 -0.0000123 -0.0000128 -0.0000391 -0.2004015 0.0028114 0.2135231 -0.0000414 0.0716691 -0.1563168 0.0000095 -0.0000181 0.0000355 -0.2004033 -0.1687684 0.0405272 -0.0000056 0.0635206 0.074519 -0.0000059 0.0000069 0.0000095 -0.2101685 -0.1687538 -0.0405527 -0.0000033 -0.0635434 0.0745136 0.0000091 -0.0000007 -0.0000071 -0.2101688 0.0642999 0.0772722 0.0000171 -0.0034894 0.1353016 0.0000018 0.0000289 0.0000035 -0.145166 0.0643025 -0.0772754 0.0000228 0.0034769 0.1352993 -0.0000076 0.0000368 -0.0000133 -0.1451668 0.0285116 0.0155501 -0.0591156 0.0342038 -0.0220535 0.0741389 -0.0773776 0.1312401 -0.0374415 0.0287174 0.0152636 0.0590302 0.0339877 -0.0218665 -0.0740883 0.077332 -0.1311672 -0.037877 0.0287206 -0.0152588 0.0590238 -0.033981 -0.021866 0.0740923 0.0773207 0.1311732 -0.0378836 0.028511 -0.0155498 -0.0591111 -0.0341995 -0.0220586 -0.0741448 -0.0773646 -0.131247 -0.0374363 -0.0738863 0.0869078 0.0000092 0.1107431 0.0232719 -0.0000048 0.0000132 -0.0000121 0.1580116 -0.0738644 -0.0869156 0.0000117 -0.1107496 0.0232544 0.0000087 0.0000118 0.0000176 0.1580129 0.0701741 0.0141222 0.0000021 -0.0442363 -0.1233222 -0.0000043 -0.0000081 -0.0000147 0.1613648 0.0701709 -0.0141076 0.0000005 0.044255 -0.1233245 0.000004 -0.0000106 0.000015 0.1613636 -0.1067146 -0.1059749 -0.0000069 -0.1039132 0.0288623 -0.0000046 -0.0000191 0.0000041 0.1542186 -0.1067304 0.1059612 -0.0000117 0.1039018 0.0288804 0.0000083 -0.0000189 -0.0000005 0.1542197 unknown
polarizability: 170.1889913|0.0011141|146.7400582|-0.003258|-0.0005449|57.4326792 unknown
InChI: InChI=1S/C12H10/c1-3-9-4-2-6-11-8-7-10(5-1)12(9)11/h1-6H,7-8H2
charge 0 multiplicity 1
22 atoms
C  -0.000002 -0.141471 -0.000007
C  0.791725 -2.412269 -0.000482
C  -0.791516 -2.412343 0.000506
C  1.183739 -0.933172 -0.000097
C  -1.183669 -0.933275 0.0001
C  -0.000064 1.290528 -0.000004
C  2.424612 -0.290173 -0.000064
C  -2.424604 -0.290403 0.000071
C  1.286907 1.926136 -0.000022
C  -1.287105 1.926012 0.000004
C  2.45601 1.147401 -0.000028
C  -2.456136 1.147177 -0.000007
H  1.190204 -2.937438 0.887251
H  1.188917 -2.936292 -0.889485
H  -1.188659 -2.936381 0.889523
H  -1.189963 -2.937561 -0.887211
H  3.363206 -0.856176 -0.000086
H  -3.363146 -0.856489 0.000112
H  1.359769 3.020365 0.000003
H  -1.360057 3.020235 -0.000017
H  3.42857 1.654048 0.0000
H  -3.428738 1.653739 -0.00006
