program: Gaussian 09
title: 000177579
version: EM64L-G09RevD.01
frameworkgroup: C1[X(C5H3Br3N2O2)]
method: RPBEPBE
basis: SDD
operation: Freq
keyword: #p
keyword: freq=noraman
keyword: PBEPBE/SDD
title: #p freq=noraman PBEPBE/SDD
converged: NO NO NO NO
title: Mulliken charges:
elementType: Br Br Br O O N N C C C C C H H H
charge: 0.123569 0.150844 0.080061 -0.267856 -0.210483 -0.198738 0.064605 -0.020909 -0.153732 -0.199952 0.361972 -0.482851 0.246313 0.253577 0.253579
chargesum: 0.00000
title: Mulliken charges with hydrogens summed into heavy atoms:
elementType: Br Br Br O O N N C C C C C
charge: 0.123569 0.150844 0.080061 -0.267856 -0.210483 -0.198738 0.064605 -0.020909 -0.153732 -0.199952 0.361972 0.270618
polarizability: 1.73543770e+02 6.53200785e+00 1.44941619e+02 4.87313178e-03 -1.25255489e-02 4.66388021e+01
1716.lowfreq: -35.1836 -0.6178 0.0002 0.0005 0.0005 4.9736 6.4757 35.1417 84.9280
frequency: -35.1040 35.1242 84.9273 103.0497 104.6665 123.9951 141.5543 144.9147 228.5821 232.4607 243.2431 271.9937 301.4436 343.2367 445.8471 485.2669 615.1200 615.8143 649.6234 703.3331 765.3812 878.3789 929.0881 1037.0497 1119.0196 1147.0824 1154.6151 1170.5895 1205.6189 1263.8878 1400.1617 1426.5928 1452.9766 1463.8074 1475.7932 1662.2540 3013.7821 3120.4694 3163.9335
redmass: 8.1316 12.0134 1.1411 5.3518 13.9190 6.4890 28.1514 5.0346 36.2232 14.4867 11.2120 7.1647 12.0647 8.4088 11.0234 12.4526 12.2945 12.0010 12.6203 12.2817 6.6610 11.1218 11.0665 10.5872 1.2538 2.4145 3.3815 6.2717 12.5287 10.1351 12.1243 1.1849 1.0490 1.0579 11.3495 10.6046 1.0293 1.1056 1.1054
irintensity: 1.0075 0.0019 0.9267 3.8240 0.5816 0.7543 0.4184 1.0903 0.2424 0.1700 2.6061 7.2705 2.9722 16.9328 2.9851 2.4789 3.4260 27.7859 0.2954 13.6132 7.1310 7.0587 37.6746 90.7320 0.0168 92.9338 95.4998 147.8059 241.5101 541.2131 178.9414 45.0481 16.7371 14.4807 33.7351 272.5031 25.4238 17.6809 7.9876
temp: 298.150 k
press: 1.00000 atm
elementType: 35 35 35 8 8 7 7 6 6 6 6 6 1 1 1
symmnumber: 1
zpe: 207699.7 jmol-1
zpe.correction: 0.079109 hartree
zpe.thermalcorrener: 0.091220 hartree
zpe.thermalcorrenthalpy: 0.092164 hartree
zpe.thermalcorrgfe: 0.037080 hartree
zpe.sumelectzpe: -491.726953 hartree
zpe.sumelectthermal: -491.714842 hartree
zpe.sumelectthermalent: -491.713898 hartree
zpe.sumelectthermalfe: -491.768982 hartree
dipole: -0.7360 4.8752 -0.0010
dipole: 4.9305
quadrupole: -95.5564 -84.7526 -95.7883
quadrupole: -3.7510 0.0030 -0.0001
quadrupole: -3.5240 7.2798 -3.7559 -3.7510 0.0030 -0.0001
hfenergy: -491.8060621 hartree
pointgroup: C01 [X(C5H3Br3N2O2)]
dipole: -1.6139044 -1.0761554 0.0003834 debye
dipolederiv: 0.0592214 -0.1398107 0.0000224 -0.1077495 -0.5269367 0.0000756 0.0000355 0.0001269 0.0989362 0.00686 0.2032917 0.0000213 0.1754082 -0.553681 -0.0000255 0.0000445 -0.0000829 0.0849585 -0.4871837 0.2168534 0.0000822 0.2740802 -0.0950463 -0.0000452 0.0001038 -0.0000335 0.0383273 -1.1265222 -0.3479836 0.0000491 -0.7950529 -0.9039393 0.0001982 0.0001031 0.0000966 -0.2753701 -0.9081246 0.2060004 -0.0000198 0.177719 -0.6985998 0.0000706 -0.0001446 0.0002579 -0.3025584 -1.8827951 -0.1564716 0.0001586 -0.0969516 -0.5520467 0.0000656 0.0002407 0.0000732 0.0430526 -0.9923368 0.4059848 0.0001387 0.496523 -0.7643384 -0.0000721 0.0001509 -0.0000919 -0.1390197 0.2921064 0.3001379 -0.000105 -0.0196006 0.8110222 -0.0001441 -0.0000568 -0.0002107 -0.0964103 0.9171342 -0.4569813 -0.0001629 0.1819417 1.2034025 0.0000352 -0.0002525 0.000156 -0.053245 0.9336683 -0.4748278 -0.0001963 -0.966771 0.3042573 0.0001732 -0.000181 0.0001053 -0.0793203 2.4404644 0.0837397 -0.0000205 0.4856194 1.43587 -0.0003417 -0.0000256 -0.0003978 0.3572717 0.731544 0.2412529 0.0000074 0.1727395 0.2765488 0.0000055 0.0000139 0.000014 0.2690926 0.0691816 0.0016706 -0.000013 -0.0712006 -0.0783666 0.0000881 0.0000081 0.0000818 0.1285379 -0.0266088 -0.0414534 -0.0279725 0.046601 0.0709848 0.0886535 -0.0641208 0.0498906 -0.0372152 -0.0266092 -0.0414029 0.0280103 0.0466942 0.0708691 -0.0887368 0.0640809 -0.0499855 -0.0370377 unknown
polarizability: 151.3844918|-13.6175084|167.1008972|-0.0125456|-0.0048212|46.6388021 unknown
InChI: InChI=1S/C5H3Br3N2O2/c1-12-5(11)10-3(7)2(6)9-4(10)8/h1H3
charge 0 multiplicity 1
15 atoms
Br 0.437597 -2.74277 0.000363
Br 0.032985 3.196664 0.000141
Br 3.762999 -1.155248 -0.000493
O  -2.031828 -1.093552 0.000527
O  -2.285251 1.219935 -0.000252
N  -0.132352 0.219789 0.000266
N  1.97262 1.114529 -0.000206
C  0.807556 -0.872012 0.000106
C  0.673219 1.397823 0.00003
C  2.063388 -0.277019 -0.000164
C  -1.571809 0.200865 0.000291
C  -3.510287 -1.239183 0.000308
H  -3.675448 -2.324539 0.000755
H  -3.934122 -0.766945 -0.900972
H  -3.934466 -0.766136 0.9010
