program: Gaussian 09
title: 000012831
version: EM64L-G09RevD.01
frameworkgroup: C1[X(C9H14N2O3)]
method: RPBEPBE
basis: SDD
operation: Freq
keyword: #p
keyword: freq=noraman
keyword: PBEPBE/SDD
title: #p freq=noraman PBEPBE/SDD
converged: YES YES NO NO
title: Mulliken charges:
elementType: O O O N N C C C C C C C C C H H H H H H H H H H H H H H
charge: -0.272599 -0.239494 -0.449634 -0.443300 -0.218859 0.316722 -0.508941 -0.459820 -0.420491 -0.452958 0.148073 0.187209 -0.356693 -0.308792 0.263193 0.233706 0.243314 0.242912 0.231637 0.221652 0.202775 0.236747 0.328351 0.254779 0.240193 0.222620 0.185885 0.371812
chargesum: 0.00000
title: Mulliken charges with hydrogens summed into heavy atoms:
elementType: O O O N N C C C C C C C C C
charge: -0.272599 -0.239494 -0.077822 -0.114950 -0.218859 0.316722 -0.012042 0.026406 0.032799 -0.013435 0.148073 0.187209 0.138279 0.099713
polarizability: 1.42472241e+02 -7.79178547e+00 1.18967051e+02 6.23483000e-01 1.95896865e+00 8.54242574e+01
1716.lowfreq: -15.9844 -5.7338 -0.0004 0.0007 0.0008 13.0946 26.6824 52.1556 65.7234
frequency: 23.5922 52.0972 65.6737 114.0909 150.4006 173.8334 182.3469 206.1432 224.7114 299.0281 327.5271 334.8372 402.3707 436.7796 477.7954 489.4550 562.0660 578.7387 631.1306 662.0713 668.7556 689.9445 714.7078 735.0156 789.1315 841.8060 852.2654 857.6364 892.2051 909.1969 949.5174 969.7676 1010.7522 1020.7873 1033.9273 1055.4969 1066.2151 1094.0725 1101.6489 1118.1237 1170.8423 1193.5370 1204.8825 1211.5104 1234.9969 1273.6556 1277.4843 1295.9616 1301.6104 1311.3576 1316.4164 1338.0661 1355.7401 1364.1423 1388.0118 1422.2417 1457.9060 1458.2322 1463.3546 1466.5717 1475.9091 1488.5324 1626.9861 1715.7834 2947.4400 2985.4941 3005.8752 3006.4959 3009.3043 3022.8358 3061.5360 3067.3286 3071.1419 3073.3782 3083.2047 3093.0441 3355.4915 3608.3971
redmass: 2.3978 5.3666 3.3719 4.1168 3.6109 6.3525 2.6779 2.5537 5.5127 3.2497 4.1359 3.5867 3.7027 3.3135 1.6872 1.6138 2.1805 5.7092 3.6466 1.9642 2.2656 4.1790 3.4211 5.9478 1.4659 2.2509 2.3169 3.2517 1.9851 2.0897 2.2451 2.4162 4.0807 1.6476 1.6410 2.7419 2.4438 2.4670 3.6733 2.6903 1.7822 1.8190 1.1494 1.5114 1.5656 1.5927 1.2697 1.2966 1.4284 1.4400 1.5772 2.2105 1.3040 1.5787 2.3695 1.1783 1.1149 1.0985 1.0784 1.1102 1.0825 1.0971 9.6287 9.8957 1.0696 1.0665 1.0597 1.0610 1.0602 1.0630 1.0982 1.0975 1.1021 1.0995 1.1040 1.1051 1.0667 1.0800
irintensity: 0.2675 0.9361 2.8069 2.1528 0.8106 1.4838 4.0184 1.0121 6.1699 0.5053 5.0657 23.6515 15.5046 0.3325 73.7290 51.6872 1.7130 11.3903 5.4134 103.6998 51.9870 14.7610 21.9554 13.6967 10.2938 9.2097 1.3516 10.5253 0.3118 5.1940 9.9885 48.0489 80.6388 8.9828 27.4909 10.0853 11.4749 5.9752 4.4691 13.3753 4.0463 4.4687 23.9469 26.2881 38.9432 23.4145 5.1369 38.1676 20.7082 25.1911 34.7701 108.2974 2.5059 5.9797 112.8993 105.3425 15.3335 22.3503 6.0571 12.6855 12.5022 6.8150 392.3559 346.7480 63.3051 36.7570 15.3412 16.4238 27.3539 25.6147 22.8630 36.7454 15.4972 17.2884 14.3181 42.3262 221.8185 44.3816
temp: 298.150 k
press: 1.00000 atm
elementType: 8 8 8 7 7 6 6 6 6 6 6 6 6 6 1 1 1 1 1 1 1 1 1 1 1 1 1 1
symmnumber: 1
zpe: 603936.9 jmol-1
zpe.correction: 0.230027 hartree
zpe.thermalcorrener: 0.243254 hartree
zpe.thermalcorrenthalpy: 0.244198 hartree
zpe.thermalcorrgfe: 0.189164 hartree
zpe.sumelectzpe: -685.487797 hartree
zpe.sumelectthermal: -685.474571 hartree
zpe.sumelectthermalent: -685.473626 hartree
zpe.sumelectthermalfe: -685.528660 hartree
dipole: 5.4097 1.1921 0.4053
dipole: 5.5543
quadrupole: -81.5541 -101.0009 -80.6245
quadrupole: -5.4483 -0.2838 -1.3897
quadrupole: 6.1724 -13.2744 7.1020 -5.4483 -0.2838 -1.3897
hfenergy: -685.7178246 hartree
pointgroup: C01 [X(C9H14N2O3)]
dipole: -2.0646145 0.6529642 -0.2936603 debye
polarizability: 143.414222|5.7437657|117.7018209|3.8094411|-2.2001024|85.7475067 unknown
InChI: InChI=1S/C9H14N2O3/c12-6-5-11-7(13)9(10-8(11)14)3-1-2-4-9/h10,12H,1-6H2
charge 0 multiplicity 1
28 atoms
O  0.420743 -1.815439 0.383902
O  1.285877 2.789406 -0.130898
O  3.177716 -2.189325 0.275567
N  -0.716663 1.501665 -0.240682
N  1.208885 0.417315 0.220106
C  -1.122255 0.088775 -0.07811
C  -1.851554 -0.506973 -1.334323
C  -2.145331 -0.122133 1.080158
C  -3.370225 -0.59729 -0.967612
C  -3.511831 0.124766 0.401199
C  0.238528 -0.575292 0.205758
C  0.637335 1.718808 -0.064901
C  2.650143 0.254999 0.509762
C  3.341252 -0.86368 -0.30503
H  -1.436412 -1.506041 -1.552196
H  -1.661391 0.13407 -2.21238
H  -1.935673 0.537538 1.939367
H  -2.068928 -1.17326 1.416943
H  -3.667887 -1.65613 -0.863354
H  -4.01328 -0.150466 -1.745476
H  -3.679686 1.210763 0.256837
H  -4.355991 -0.257156 1.000914
H  -1.355613 2.265381 -0.451892
H  2.786919 0.03664 1.585861
H  3.100398 1.24054 0.292513
H  4.428411 -0.675158 -0.29206
H  2.99411 -0.820886 -1.361063
H  2.195304 -2.362138 0.371689
