program: Gaussian 09
title: 000177616
version: EM64L-G09RevD.01
frameworkgroup: C1[X(C14H15N7)]
method: RPBEPBE
basis: SDD
operation: Freq
keyword: #pfreq=noraman
keyword: PBEPBE/SDD
title: #p freq=noraman PBEPBE/SDD
converged: YES YES NO NO
title: Mulliken charges:
elementType: N N N N N N N C C C C C C C C C C C C C C H H H H H H H H H H H H H H H
charge: -0.407407 -0.172742 -0.001097 -0.655254 -0.655895 -0.379081 -0.367991 0.492423 0.404327 -0.565141 0.375510 -0.382617 -0.406730 0.170773 -0.203134 -0.426207 -0.395743 -0.357993 -0.215208 0.072132 0.067952 0.283512 0.277436 0.218834 0.305815 0.227538 0.224384 0.249976 0.226974 0.311620 0.314240 0.317840 0.312415 0.316182 0.212852 0.209506
chargesum: 0.00000
title: Mulliken charges with hydrogens summed into heavy atoms:
elementType: N N N N N N N C C C C C C C C C C C C C C
charge: -0.095787 -0.172742 -0.001097 -0.023174 -0.027298 -0.166230 -0.158485 0.492423 0.404327 -0.281629 0.375510 -0.105181 -0.187896 0.170773 0.024404 -0.120393 -0.171359 -0.108017 0.011767 0.072132 0.067952
polarizability: 4.47776548e+02 2.19783589e+01 2.36016648e+02 -3.41751676e+00 -5.93694808e+00 8.59924392e+01
1716.lowfreq: -8.4328 -4.8384 -0.0010 -0.0008 0.0004 2.6900 13.2451 29.2574 32.4804
frequency: 12.8316 29.1634 32.4739 49.2648 60.4602 102.6152 121.0014 151.4256 158.8604 181.8366 206.5741 236.1919 247.1992 254.4097 314.1816 343.0413 369.0500 398.2838 405.7188 414.7576 427.5295 430.5590 451.7925 452.9568 473.8390 491.6851 510.0761 550.6094 556.5344 562.1735 568.3918 634.9356 647.9725 681.4194 689.6923 705.1502 706.6562 715.2724 725.3304 768.8724 800.7176 804.8248 819.6081 823.3306 894.3977 905.4674 917.1105 930.6570 955.5094 961.5443 983.1544 984.6766 986.7769 987.7513 1040.6998 1041.7748 1072.7706 1073.2931 1088.3977 1092.8150 1111.6839 1128.2946 1166.6198 1177.0476 1184.6305 1214.8168 1260.0257 1288.7300 1307.9160 1352.3065 1365.7085 1373.9496 1390.8904 1397.7699 1425.5985 1433.9189 1472.6215 1484.8829 1511.9035 1579.5523 1582.5078 1600.8502 1604.2457 1605.2903 1619.4653 1635.3315 1636.4946 3126.7057 3128.8765 3141.4511 3146.7074 3152.4449 3167.8941 3181.0562 3185.4646 3321.3523 3329.3654 3391.1693 3533.9541 3536.7141 3679.2270 3681.5002
redmass: 5.1571 5.1492 5.8409 4.7142 4.8649 6.1600 5.0453 4.1236 4.1860 5.5452 4.4525 4.9831 5.1771 4.3719 5.3703 4.3276 4.5566 3.4427 2.2910 2.3820 1.3897 1.2960 1.2537 1.2563 4.5385 3.9184 4.5553 3.6437 3.1924 3.3848 4.0237 6.4546 6.6075 3.5945 2.9181 3.0438 1.9322 3.6816 1.4094 5.3789 1.5657 1.5486 1.3466 1.3678 4.4495 1.4187 1.4261 1.5393 1.7853 2.4931 1.6342 3.1454 1.7214 3.2013 1.5823 1.5656 1.8053 1.7721 1.5457 1.5831 1.6182 1.5105 3.8658 1.1737 1.1485 3.3817 1.9680 1.3966 1.4471 6.5398 3.3894 3.4045 8.7376 9.5909 2.6368 3.2374 2.7557 3.0031 2.2293 5.1601 4.8494 6.2300 2.9923 3.1239 5.1162 1.5234 1.6020 1.0867 1.0871 1.0918 1.0916 1.0944 1.0982 1.0914 1.0957 1.0761 1.0762 1.0746 1.0450 1.0451 1.1035 1.1035
irintensity: 0.8524 7.6634 1.2919 0.5387 14.2336 3.3199 0.4955 7.5291 2.9173 6.9817 6.5827 3.8031 5.6490 0.5607 3.1035 4.7486 1.5864 26.0789 2.6329 3.1838 140.9168 193.8778 65.8521 160.9951 6.5240 1.8483 25.6298 1.6550 17.4525 30.8802 17.7382 44.5828 1.1380 14.0700 10.9174 21.5205 4.2588 8.1793 124.6681 1.8117 8.4242 9.4203 104.9035 128.4180 19.9987 0.8665 0.6691 43.8236 23.4358 7.2844 2.3800 2.3915 1.5752 0.5594 14.1899 3.5891 95.3235 105.9595 30.4514 7.7340 41.1511 18.3025 206.7853 11.4745 6.7125 57.3096 194.5498 33.9853 17.2195 201.4471 136.0664 266.7803 7.8077 38.6599 29.0513 130.5685 11.5012 113.1260 233.0630 9.7294 99.2145 24.5119 92.0851 82.0296 179.8550 186.1915 115.5825 6.2983 7.5224 12.4082 23.0014 21.9158 22.7388 2.6445 2.2485 37.9381 36.6084 10.9422 18.4309 19.6775 18.2209 22.2575
temp: 298.150 k
press: 1.00000 atm
elementType: 7 7 7 7 7 7 7 6 6 6 6 6 6 6 6 6 6 6 6 6 6 1 1 1 1 1 1 1 1 1 1 1 1 1 1 1
symmnumber: 1
zpe: 733448.4 jmol-1
zpe.correction: 0.279356 hartree
zpe.thermalcorrener: 0.298552 hartree
zpe.thermalcorrenthalpy: 0.299496 hartree
zpe.thermalcorrgfe: 0.229519 hartree
zpe.sumelectzpe: -924.212690 hartree
zpe.sumelectthermal: -924.193494 hartree
zpe.sumelectthermalent: -924.192550 hartree
zpe.sumelectthermalfe: -924.262527 hartree
dipole: -0.0638 2.1391 0.2142
dipole: 2.1508
quadrupole: -48.8910 -110.6488 -131.2380
quadrupole: 5.3932 -16.8420 3.5377
quadrupole: 48.0349 -13.7229 -34.3121 5.3932 -16.8420 3.5377
hfenergy: -924.4920458 hartree
pointgroup: C01 [X(C14H15N7)]
dipole: -0.035377 0.7723382 0.3438774 debye
polarizability: 446.6302174|27.7933619|225.9974093|-4.6132406|39.25417|97.1580078 unknown
InChI: InChI=1S/C14H15N7/c15-13(16)9-3-1-5-11(7-9)19-21-20-12-6-2-4-10(8-12)14(17)18/h1-8,15,17,19H,16,18H2
charge 0 multiplicity 1
36 atoms
N  1.084926 -0.973866 -0.299601
N  -1.022639 -1.609741 -0.484648
N  -0.223167 -0.620313 -0.158713
N  6.945514 0.765644 -0.216042
N  -6.158205 1.403701 1.229595
N  6.106845 -1.503391 -0.116244
N  -4.081821 2.486599 0.611344
C  2.130915 -0.07225 -0.010613
C  4.547058 0.34071 0.109311
C  3.462598 -0.522516 -0.16593
C  -4.344461 0.107815 0.196833
C  1.868752 1.255881 0.424075
C  4.289513 1.662879 0.557362
C  -2.415319 -1.307292 -0.354434
C  2.954381 2.104785 0.708166
C  -2.94776 -0.073321 0.103137
C  -5.218158 -0.947631 -0.186494
C  -3.294014 -2.361736 -0.721877
C  -4.688083 -2.175324 -0.642648
C  5.937662 -0.195075 -0.084076
C  -4.861591 1.426428 0.70041
H  3.698228 -1.54385 -0.48652
H  0.836137 1.594734 0.535659
H  5.108978 2.334822 0.835722
H  -2.292265 0.755472 0.382173
H  2.757354 3.123212 1.060177
H  -6.304844 -0.80431 -0.178509
H  -2.860006 -3.304631 -1.069861
H  -5.363567 -2.982413 -0.945834
H  1.290806 -1.932412 -0.622275
H  7.917114 0.477565 -0.308618
H  6.726158 1.750866 -0.342545
H  -6.590853 2.265059 1.556334
H  -6.633861 0.526464 1.428188
H  7.092674 -1.791965 -0.283663
H  -4.507798 3.347901 1.01286
