program: Gaussian 09
title: 000177581
version: EM64L-G09RevD.01
frameworkgroup: C1[X(C13H13PS2)]
method: RPBEPBE
basis: SDD
operation: Freq
keyword: #p
keyword: freq=noraman
keyword: PBEPBE/SDD
title: #p freq=noraman PBEPBE/SDD
converged: YES YES NO NO
title: Mulliken charges:
elementType: S S P C C C C C C C C C C C C C H H H H H H H H H H H H H
charge: 0.030786 -0.223185 0.068092 0.013106 0.038257 -0.251563 -0.265857 -0.260502 -0.310393 -0.226851 -0.225565 -0.219930 -0.215462 -0.222191 -0.226115 -0.827101 0.265428 0.268423 0.269781 0.286874 0.234965 0.236089 0.235622 0.236238 0.234657 0.234287 0.264171 0.291313 0.266628
chargesum: 0.00000
title: Mulliken charges with hydrogens summed into heavy atoms:
elementType: S S P C C C C C C C C C C C C C
charge: 0.030786 -0.223185 0.068092 0.013106 0.038257 0.013865 0.002566 0.009278 -0.023519 0.008114 0.010524 0.015692 0.020776 0.012466 0.008172 -0.004989
polarizability: 2.24194071e+02 6.90221839e+00 2.09328980e+02 -1.43107406e+01 6.37228035e+00 1.67065693e+02
1716.lowfreq: -12.7543 -8.7898 0.0008 0.0014 0.0028 3.2520 13.9637 28.1805 40.6152
frequency: 13.5432 27.3473 40.5686 57.5346 75.6118 98.9654 126.7409 142.2899 158.2117 199.4917 209.8008 227.3635 251.2310 269.4892 318.1043 394.0915 397.7798 404.7736 455.7667 477.2515 502.8447 577.3580 610.1493 612.3436 651.1138 682.6396 691.8634 696.3737 699.0020 760.5186 764.4544 851.9766 859.7511 930.0787 938.1391 972.8538 980.0597 985.0066 985.3334 986.2663 990.2422 1002.2084 1004.8459 1018.3059 1019.9263 1077.1541 1081.3467 1081.7140 1084.7169 1174.3754 1175.0504 1189.9310 1193.1170 1308.4283 1311.6129 1346.7811 1378.0996 1380.7364 1423.8745 1426.5646 1447.0731 1455.7517 1462.7558 1465.1310 1584.7529 1586.7472 1591.8513 1593.2816 2958.5391 3091.6446 3126.7921 3130.0752 3131.8222 3138.0983 3141.0054 3143.4728 3147.4501 3153.8364 3157.1332 3167.4848 3169.3221
redmass: 3.6402 3.1677 3.8092 5.3436 6.1883 8.8781 4.2650 1.3025 7.5761 4.2626 5.2509 4.7071 5.8192 5.4493 8.6417 2.7936 2.8721 7.9191 13.0957 3.7594 4.1281 11.6009 6.4675 6.6574 7.7831 7.0013 6.3752 1.9912 2.0739 1.6211 1.6011 1.2482 1.2460 1.3689 1.3708 1.1925 1.3837 5.6774 2.2967 2.2496 1.2111 1.3278 1.3242 3.2151 3.1452 1.8971 2.1192 1.9129 2.0996 1.0553 1.0537 1.1244 1.1217 1.3277 1.3174 1.1193 7.8164 8.8456 2.1142 2.1292 1.0513 1.0542 2.0314 2.0161 5.9586 6.0774 5.8395 5.8796 1.0400 1.0893 1.0865 1.0850 1.0877 1.0879 1.0917 1.1066 1.0925 1.0962 1.0967 1.1016 1.1018
irintensity: 0.3864 1.4294 0.3137 0.5999 0.7142 0.2773 4.6752 0.6067 6.5675 2.2656 2.4927 0.1248 0.3527 3.4217 1.8169 0.0361 0.2449 26.3357 44.4494 2.4487 70.2401 71.2353 0.4652 4.7410 3.4909 7.2712 6.3521 59.1413 37.6599 45.7666 28.6202 0.1028 0.6319 0.6998 0.4389 6.7370 0.6220 2.8618 1.2393 1.6353 12.5216 0.1430 0.0493 1.8442 4.5380 28.1315 12.5505 6.0336 14.0571 0.0664 0.1455 7.9049 5.1385 8.4469 3.4191 6.5919 0.3623 0.1904 24.9958 18.8805 15.0635 14.0082 7.8630 16.7002 0.1613 0.3887 0.1461 0.9250 39.0917 5.7584 0.9998 0.0274 1.8809 2.2611 3.8879 10.8331 7.4938 21.4804 17.9896 35.1893 26.9791
temp: 298.150 k
press: 1.00000 atm
elementType: 16 16 15 6 6 6 6 6 6 6 6 6 6 6 6 6 1 1 1 1 1 1 1 1 1 1 1 1 1
symmnumber: 1
zpe: 577779.2 jmol-1
zpe.correction: 0.220064 hartree
zpe.thermalcorrener: 0.236613 hartree
zpe.thermalcorrenthalpy: 0.237557 hartree
zpe.thermalcorrgfe: 0.172684 hartree
zpe.sumelectzpe: -1639.403673 hartree
zpe.sumelectthermal: -1639.387124 hartree
zpe.sumelectthermalent: -1639.386180 hartree
zpe.sumelectthermalfe: -1639.451053 hartree
dipole: -0.5445 -3.0452 -2.0155
dipole: 3.6922
quadrupole: -99.1176 -107.1136 -124.1738
quadrupole: 0.8305 -2.1255 -3.2496
quadrupole: 11.0174 3.0214 -14.0388 0.8305 -2.1255 -3.2496
hfenergy: -1639.6237375 hartree
pointgroup: C01 [X(C13H13P1S2)]
dipole: 0.1087209 1.221969 -0.7778646 debye
polarizability: 220.9778659|8.4689034|211.1940487|17.4116553|-3.9044085|168.4168287 unknown
InChI: InChI=1S/C12H10PS.CH3S/c14-13(11-7-3-1-4-8-11)12-9-5-2-6-10-12;1-2/h1-10H;1H3
charge 0 multiplicity 1
29 atoms
S  0.215791 -2.382288 -1.566125
S  0.316766 -2.130964 2.120805
P  0.1540 -1.039061 0.341594
C  -1.460271 -0.15028 0.063872
C  1.514474 0.22108 0.123537
C  -1.552782 1.245212 0.286164
C  1.650813 0.914202 -1.103721
C  -2.608114 -0.896192 -0.296264
C  2.414105 0.455547 1.18747
C  -2.799588 1.894024 0.138921
C  2.688487 1.859637 -1.256795
C  -3.849782 -0.240059 -0.4424
C  3.452168 1.401759 1.02641
C  -3.947894 1.154249 -0.225083
C  3.588855 2.105413 -0.192221
C  1.256432 -3.789827 -0.871622
H  -0.666725 1.822148 0.572038
H  0.967051 0.707808 -1.934709
H  -2.524423 -1.974801 -0.466598
H  2.297108 -0.108013 2.120867
H  -2.871132 2.973478 0.310785
H  2.798664 2.396571 -2.205167
H  -4.73741 -0.816182 -0.725057
H  4.15105 1.585334 1.849608
H  -4.912842 1.660704 -0.338243
H  4.396005 2.836128 -0.315982
H  0.851912 -4.7237 -1.290485
H  1.140323 -3.796577 0.230368
H  2.311759 -3.655649 -1.148368
