program: Gaussian 09
title: 000177573
version: EM64L-G09RevD.01
frameworkgroup: C1[X(C14H13NO3)]
method: RPBEPBE
basis: SDD
operation: Freq
keyword: #p
keyword: freq=noraman
keyword: PBEPBE/SDD
title: #p freq=noraman PBEPBE/SDD
converged: YES YES NO YES
title: Mulliken charges:
elementType: O O O N C C C C C C C C C C C C C C H H H H H H H H H H H H H
charge: -0.286811 -0.218595 -0.218633 0.021141 -0.000031 0.348647 0.348613 -0.410569 -0.410574 0.373829 -0.223736 -0.805274 -0.805249 -0.319267 -0.357749 0.374640 -0.352066 -0.330245 0.239719 0.239728 0.229770 0.248427 0.243751 0.227776 0.243736 0.227772 0.248420 0.278135 0.268764 0.286630 0.289301
chargesum: 0.00000
title: Mulliken charges with hydrogens summed into heavy atoms:
elementType: O O O N C C C C C C C C C C C C C C
charge: -0.286811 -0.218595 -0.218633 0.021141 -0.000031 0.348647 0.348613 -0.170849 -0.170847 0.373829 0.006034 -0.085320 -0.085321 -0.041132 -0.088985 0.374640 -0.065437 -0.040944
polarizability: 2.60394169e+02 -3.46694513e-02 1.32168287e+02 -1.43214187e+01 5.06922740e-02 1.43123550e+02
1716.lowfreq: -9.2904 -6.7873 0.0004 0.0005 0.0008 6.0130 23.0997 35.7012 54.5720
frequency: 23.0325 35.5956 54.5713 75.9706 94.2126 115.3628 116.3551 124.9878 184.9841 224.5264 245.3785 258.3349 287.8818 314.4487 319.0265 398.9983 417.5306 468.5822 488.1589 490.8238 512.3973 513.6533 538.6824 552.8176 611.6693 629.3093 663.6957 670.9910 728.5633 738.2984 755.7957 783.7657 796.0034 831.2430 852.6850 854.7251 899.5248 918.1232 979.5651 981.5179 985.7678 989.5680 993.4172 1041.8171 1046.2028 1048.2715 1084.9975 1095.0990 1105.9142 1142.3656 1158.5132 1178.4777 1218.5895 1225.2143 1259.7243 1277.1621 1284.1451 1353.5908 1371.1382 1402.0559 1402.1393 1402.9720 1427.4809 1433.6922 1455.0499 1464.1396 1465.1336 1470.9271 1483.7905 1484.9398 1588.9761 1593.3907 1610.9545 1612.5206 2982.6567 2983.1518 3061.2817 3061.4052 3097.2790 3097.5438 3127.6006 3137.1807 3158.8469 3161.4762 3168.1222 3183.7460 3189.1088
redmass: 4.5976 5.5465 5.5073 6.1582 6.7600 1.5279 1.0359 1.6327 6.9363 2.9228 3.8450 5.3873 3.9435 4.3889 5.3290 6.5325 3.0344 3.3944 6.0728 3.2364 3.0993 5.7474 5.6216 4.8025 5.8442 6.6027 4.7947 5.6477 5.1115 5.5708 6.1667 1.2828 6.0001 1.2445 5.8162 1.6287 1.3099 2.5317 1.3388 1.3168 1.6179 1.3417 2.8626 1.7920 1.5410 1.5302 1.9935 3.2027 1.2365 3.6020 1.3776 1.1669 3.7278 7.2904 1.5704 3.1645 1.2783 8.2417 7.0158 4.8783 1.2674 1.3431 2.4766 4.6363 1.8548 1.0751 1.0621 2.3195 1.2794 1.2562 7.7151 5.7401 6.5887 8.1001 1.0384 1.0383 1.0955 1.0956 1.0998 1.0997 1.0861 1.0922 1.0896 1.0993 1.0893 1.0955 1.0971
irintensity: 0.2264 0.0053 0.3169 0.0059 3.0304 1.2165 0.0794 0.2721 2.3316 0.0125 6.5894 3.5179 5.2023 0.3441 2.6647 2.2249 0.0533 3.0861 3.0608 4.8191 0.0006 1.1679 0.3298 0.9224 0.7832 12.0440 16.8253 3.5952 8.6053 2.9395 1.8705 47.9895 22.2055 0.0011 36.4342 70.0355 0.0560 4.5353 0.1769 3.1079 9.0174 0.0008 1.9245 0.6870 15.2065 0.3489 72.1416 20.8156 21.9034 152.0357 235.9538 1.4063 392.5933 300.1516 0.2186 17.8656 3.9297 90.0028 3.7834 26.9278 20.0725 0.1225 33.7084 10.8721 0.3942 53.6217 0.0146 80.3378 19.8847 58.9708 47.0605 28.3104 190.3716 3.3416 32.3758 7.3737 2.1633 29.5155 16.0513 26.6594 0.1787 19.7338 1.9916 29.0929 0.8678 0.9645 3.4217
temp: 298.150 k
press: 1.00000 atm
elementType: 8 8 8 7 6 6 6 6 6 6 6 6 6 6 6 6 6 6 1 1 1 1 1 1 1 1 1 1 1 1 1
symmnumber: 1
zpe: 622771.9 jmol-1
zpe.correction: 0.237201 hartree
zpe.thermalcorrener: 0.253581 hartree
zpe.thermalcorrenthalpy: 0.254525 hartree
zpe.thermalcorrgfe: 0.191641 hartree
zpe.sumelectzpe: -820.350947 hartree
zpe.sumelectthermal: -820.334567 hartree
zpe.sumelectthermalent: -820.333623 hartree
zpe.sumelectthermalfe: -820.396507 hartree
dipole: 6.4565 0.0004 0.6712
dipole: 6.4913
quadrupole: -132.0866 -97.1683 -104.0698
quadrupole: -0.0165 -12.6373 -0.0046
quadrupole: -20.9784 13.9399 7.0384 -0.0165 -12.6373 -0.0046
hfenergy: -820.5881479 hartree
pointgroup: C01 [X(C14H13N1O3)]
dipole: -2.541953 0.0006976 -0.2463231 debye
polarizability: 260.1884684|0.1231588|132.1689628|-15.1383392|-0.1011823|143.3285754 unknown
InChI: InChI=1S/C14H13NO3/c1-10-4-3-5-11(2)14(10)18-13-8-6-12(7-9-13)15(16)17/h3-9H,1-2H3
charge 0 multiplicity 1
31 atoms
O  -0.944417 0.00713 -1.294285
O  4.640596 -0.009941 1.819996
O  5.34456 0.004046 -0.35196
N  4.41244 -0.002074 0.54587
C  -2.072803 0.001999 -0.399848
C  -2.626042 -1.250243 -0.036334
C  -2.62624 1.250078 -0.022538
C  -3.79628 -1.229645 0.76321
C  -3.796465 1.220532 0.776733
C  0.352122 0.004258 -0.769524
C  -4.375307 -0.006806 1.169452
C  -1.991337 -2.54806 -0.495118
C  -1.991747 2.552891 -0.46721
C  0.635733 -0.004481 0.621566
C  1.399475 0.010668 -1.72744
C  3.010744 0.00006 0.090828
C  1.974223 -0.006521 1.051415
C  2.734355 0.008584 -1.298344
H  -4.253305 -2.18027 1.060727
H  -4.253658 2.167751 1.084678
H  -5.2818 -0.010272 1.784302
H  -1.831332 -2.549214 -1.588071
H  -1.000023 -2.703985 -0.028371
H  -2.626929 -3.410107 -0.233187
H  -1.000505 2.703929 0.001274
H  -2.627502 3.411962 -0.196076
H  -1.831645 2.565801 -1.560076
H  -0.180987 -0.009639 1.349412
H  1.141813 0.017194 -2.790029
H  2.231098 -0.01313 2.113943
H  3.564566 0.013402 -2.009096
