program: Gaussian 09
title: 000177706
version: EM64L-G09RevD.01
frameworkgroup: C1[X(C15H24N2O4)]
method: RPBEPBE
basis: SDD
operation: Freq
keyword: #p
keyword: freq=noraman
keyword: PBEPBE/SDD
title: #p freq=noraman PBEPBE/SDD
converged: NO YES NO NO
title: Mulliken charges:
elementType: O O O O N N C C C C C C C C C C C C C C C H H H H H H H H H H H H H H H H H H H H H H H H
charge: -0.487238 -0.428834 -0.221965 -0.220817 -0.152938 -0.358060 -0.226500 -0.540313 -0.019149 -0.152334 -0.064152 -0.499986 0.195324 -0.462538 -0.088234 -0.752136 -0.738338 -0.525874 -0.543288 0.148862 0.145143 0.253995 0.205739 0.228732 0.219718 0.255084 0.216537 0.229106 0.208569 0.223833 0.216999 0.284325 0.218528 0.218426 0.222574 0.217621 0.222082 0.241964 0.249783 0.254924 0.282477 0.246320 0.362204 0.345367 0.368459
chargesum: 0.00000
title: Mulliken charges with hydrogens summed into heavy atoms:
elementType: O O O O N N C C C C C C C C C C C C C C C
charge: -0.125033 -0.060375 -0.221965 -0.220817 -0.152938 -0.012693 0.027495 -0.105842 0.200569 0.102750 0.152385 -0.062312 0.195324 -0.021705 0.196091 -0.092609 -0.056672 -0.021167 -0.014492 0.148862 0.145143
polarizability: 2.03316229e+02 -1.19609801e+01 1.86912798e+02 1.98142596e+01 -5.94480086e-01 1.60991631e+02
1716.lowfreq: -17.7994 -12.3653 -8.2063 -0.0007 -0.0007 -0.0003 8.3124 24.0406 35.2281
frequency: -3.1961 22.8257 34.7851 44.0347 62.3581 75.1557 96.9013 114.2339 140.6325 158.2589 183.9587 195.5700 204.0136 211.5319 236.3913 254.6971 273.4950 303.9744 316.1924 334.4446 345.5679 357.0452 364.7361 398.0242 408.9927 426.9765 431.8802 438.7819 498.9071 507.4090 528.9021 532.6750 574.1571 593.3169 598.0474 608.1328 664.6844 682.9095 695.0042 718.6819 777.9544 796.5258 818.7584 829.2554 855.4424 870.5180 873.1964 885.9542 898.8470 910.8129 911.5196 941.7379 949.4665 972.5535 1007.9008 1013.3981 1030.4146 1054.7651 1062.9117 1071.0360 1088.9073 1093.0274 1114.3660 1126.7082 1139.7364 1166.8255 1175.8339 1187.7223 1215.3704 1229.1711 1234.3079 1248.1628 1259.5526 1267.1756 1272.4009 1291.4890 1293.9063 1296.9025 1306.6276 1312.4025 1315.6405 1321.1116 1324.3162 1330.8261 1340.5825 1346.6955 1349.0686 1362.0186 1363.4597 1369.9818 1383.1651 1392.2067 1410.5773 1439.9063 1451.2092 1453.4675 1464.8774 1470.1358 1475.4320 1479.5773 1482.7951 1490.3752 1586.3811 1635.8733 1639.8593 2929.4793 2958.8766 2970.1061 2973.4833 2980.5738 2983.8679 2986.2177 2987.4066 2987.6928 3001.0827 3008.4915 3030.5633 3032.0412 3043.5641 3058.6779 3065.2644 3071.2987 3071.8968 3082.0636 3096.4619 3098.0297 3292.2353 3480.9071 3566.3312
redmass: 5.9146 5.0838 3.2871 8.7068 6.5456 4.1088 4.3371 3.3940 5.1277 4.0177 4.1997 1.1316 4.0769 2.6084 1.2101 2.2141 3.7592 2.6835 3.1716 3.0665 5.3042 3.0545 2.3653 2.7377 1.9386 1.9173 2.3777 3.2789 4.3853 4.5110 2.5162 3.6115 3.8903 2.8904 2.1678 1.5487 4.5850 4.6296 3.8501 2.9626 2.3757 1.3641 2.3585 3.1204 2.2265 2.8661 2.7237 2.2750 2.4731 2.4040 2.1699 2.3678 1.8120 2.1330 1.8399 1.9640 1.7461 2.5433 1.7905 2.5179 1.9393 2.0343 1.5734 2.0143 1.3603 1.4238 3.1210 1.4534 1.4875 1.3972 1.3065 1.4827 1.4276 1.5936 1.7100 1.5948 1.4360 1.5105 1.3247 1.6618 1.6653 1.4583 1.4397 1.4291 1.4264 1.3646 1.5317 1.4439 1.4512 1.8076 1.1986 1.2092 1.4595 1.0841 1.0882 1.0808 1.0647 1.0664 1.0484 1.0572 1.0578 1.0668 7.0592 11.3334 5.4172 1.0824 1.0795 1.0357 1.0590 1.0664 1.0663 1.0518 1.0557 1.0677 1.0754 1.0823 1.1016 1.0985 1.0990 1.0891 1.0991 1.0995 1.0942 1.0988 1.1000 1.0914 1.0672 1.0759 1.0675
irintensity: 0.7275 1.7425 0.2045 0.4992 1.2917 1.0851 0.8685 2.4662 4.7388 2.7596 0.8760 0.2861 1.0464 1.7286 0.2796 2.5831 3.2821 1.8646 1.6376 2.9217 17.4095 11.2691 5.6051 7.1731 45.5450 53.6393 8.4016 16.4367 6.2530 5.7523 3.5252 12.0963 19.6872 3.1846 51.9994 63.7975 0.4869 0.8582 2.0506 2.0100 0.8787 88.1253 41.8714 15.8663 16.6991 4.6660 77.5493 3.6685 30.1264 11.9725 21.8748 2.2571 11.5136 4.0179 6.1017 5.9090 2.7877 25.9456 24.8833 6.1812 18.0830 3.2353 3.9262 6.1450 118.3166 10.3088 11.1719 2.5573 40.5192 21.8290 30.0639 23.4916 1.2974 53.9727 104.2881 1.7954 35.8160 22.6707 9.1602 39.7671 32.5387 2.5487 10.5967 7.2750 2.6639 0.9431 15.2961 4.1372 3.5012 18.0150 15.4552 17.9082 97.6021 8.8446 1.7002 29.5181 2.8296 10.5141 11.7492 2.0486 10.9305 22.1324 5.5102 122.1753 428.1913 32.3726 12.4294 29.8253 17.5892 33.0601 15.8583 2.6424 47.1629 5.3360 39.3701 8.5168 33.1242 19.9283 38.5104 18.9033 57.9219 36.3959 14.4496 28.9162 23.1142 6.9590 156.5936 31.6047 48.2224
temp: 298.150 k
press: 1.00000 atm
elementType: 8 8 8 8 7 7 6 6 6 6 6 6 6 6 6 6 6 6 6 6 6 1 1 1 1 1 1 1 1 1 1 1 1 1 1 1 1 1 1 1 1 1 1 1 1
symmnumber: 1
zpe: 992469.9 jmol-1
zpe.correction: 0.378012 hartree
zpe.thermalcorrener: 0.398685 hartree
zpe.thermalcorrenthalpy: 0.399630 hartree
zpe.thermalcorrgfe: 0.328395 hartree
zpe.sumelectzpe: -994.736440 hartree
zpe.sumelectthermal: -994.715766 hartree
zpe.sumelectthermalent: -994.714822 hartree
zpe.sumelectthermalfe: -994.786057 hartree
dipole: 3.4969 -1.1896 -0.8774
dipole: 3.7964
quadrupole: -132.6562 -121.9006 -137.9065
quadrupole: 8.3215 -3.2319 -1.0050
quadrupole: -1.8351 8.9205 -7.0854 8.3215 -3.2319 -1.0050
hfenergy: -995.1144516 hartree
pointgroup: C01 [X(C15H24N2O4)]
dipole: 1.3875982 -0.478708 -0.2763058 debye
polarizability: 204.4753636|-7.6849538|185.3551922|21.1514422|-4.3511074|161.3901027 unknown
InChI: InChI=1S/C15H24N2O4/c1-8-3-9(2)15(17-21)11(4-8)12(18)5-10-6-13(19)16-14(20)7-10/h8-12,16,18,21H,3-7H2,1-2H3
charge 0 multiplicity 1
45 atoms
O  0.354947 -2.417684 0.266988
O  4.328901 -1.980775 0.979048
O  -4.940335 0.636057 -1.507081
O  -2.729052 1.166416 2.527218
N  3.112025 -1.909338 0.147088
N  -3.830229 0.813907 0.518613
C  1.450937 -0.515756 -0.884964
C  1.351265 0.92214 -1.447279
C  1.412546 2.040168 -0.367901
C  3.440221 0.569834 0.481191
C  0.232643 -0.980894 -0.012053
C  2.396726 1.678306 0.794792
C  2.740582 -0.662484 -0.069992
C  -1.123583 -0.780417 -0.714168
C  -2.293278 -1.50849 0.000444
C  1.751082 3.399196 -1.024197
C  4.594772 1.027869 -0.458329
C  -3.624308 -1.311891 -0.765298
C  -2.49176 -1.049882 1.466751
C  -4.189104 0.100264 -0.649962
C  -2.993749 0.382832 1.576927
H  1.486485 -1.231001 -1.731405
H  2.181594 1.066483 -2.16616
H  0.423648 1.029166 -2.039332
H  0.401821 2.134306 0.080248
H  3.919421 0.268773 1.432982
H  0.243576 -0.419023 0.948719
H  1.810482 1.348501 1.674681
H  2.942406 2.587099 1.115191
H  -1.336224 0.304115 -0.790534
H  -1.048866 -1.176336 -1.74668
H  -2.038933 -2.582089 0.017639
H  2.773607 3.391048 -1.44672
H  1.048106 3.634247 -1.845902
H  1.69602 4.222003 -0.287787
H  4.234965 1.310233 -1.462395
H  5.102053 1.906341 -0.018801
H  5.338682 0.220335 -0.571537
H  -4.394024 -2.006072 -0.369732
H  -3.522136 -1.534173 -1.841435
H  -1.566907 -1.137224 2.057156
H  -3.241153 -1.703618 1.958443
H  1.332864 -2.637233 0.339172
H  -4.204495 1.768363 0.596481
H  4.47876 -2.95882 1.045673
