program: Gaussian 09
title: 000177458
version: EM64L-G09RevD.01
frameworkgroup: C1[X(C16H12O6)]
method: RPBEPBE
basis: SDD
operation: Freq
keyword: #pfreq=noraman
keyword: PBEPBE/SDD
title: #p freq=noraman PBEPBE/SDD
converged: NO NO NO NO
title: Mulliken charges:
elementType: O O O O O O C C C C C C C C C C C C C C C C H H H H H H H H H H H H
charge: -0.455272 -0.311165 -0.198287 -0.374172 -0.411288 -0.241924 0.330699 0.107082 0.175891 0.340832 0.050807 -0.295546 -0.637760 -0.015430 0.426178 0.213572 -0.015074 -0.581241 0.378588 -0.595054 -0.791260 -0.535706 0.291471 0.319983 0.239844 0.244751 0.225177 0.244716 0.401294 0.360679 0.397643 0.226098 0.257774 0.226099
chargesum: 0.00000
title: Mulliken charges with hydrogens summed into heavy atoms:
elementType: O O O O O O C C C C C C C C C C C C C C C C
charge: -0.053978 -0.311165 -0.198287 -0.013494 -0.013645 -0.241924 0.330699 0.107082 0.175891 0.340832 0.050807 -0.295546 -0.346289 -0.015430 0.426178 0.213572 -0.015074 -0.261258 0.378588 -0.355210 -0.076616 0.174266
polarizability: 3.95934515e+02 -9.46477256e+00 2.24995246e+02 -1.68000940e-02 6.79764959e-03 8.35932183e+01
1716.lowfreq: -9.2608 -3.4330 -0.0009 -0.0006 0.0003 2.2333 33.9858 50.5839 81.7825
frequency: 33.9836 50.5298 81.7726 91.2239 102.4976 128.5446 129.8670 162.7725 180.7543 198.2829 205.2341 240.2360 243.3863 258.1607 274.7009 277.2804 318.5395 330.4488 344.6462 346.4862 399.4781 405.1081 420.2639 443.5711 464.6909 493.1922 512.1096 523.2157 551.6762 563.0920 580.8989 582.9838 590.8871 626.2492 634.4848 677.9039 697.2724 738.1224 741.0580 753.3188 797.7515 820.4330 845.4349 902.1018 924.8293 937.1857 949.5011 983.5780 1005.6416 1006.9926 1021.5461 1049.3975 1074.0248 1079.8568 1109.5667 1149.2927 1159.4089 1171.9851 1195.1367 1213.4857 1234.9064 1272.3043 1282.3439 1313.0554 1334.3612 1354.5481 1392.2178 1403.9207 1414.4072 1432.5448 1439.1323 1449.7140 1455.3005 1458.7461 1468.8574 1469.0563 1479.3799 1482.5168 1544.6605 1555.5125 1582.0635 1587.8274 1612.1518 1632.5951 2501.6585 2969.0191 2988.1972 3062.9316 3065.1377 3102.8232 3135.8415 3139.3563 3155.4887 3177.2918 3457.1030 3541.0357
redmass: 5.8732 5.7754 1.0410 3.8470 6.9498 4.8387 7.0447 7.2197 2.1184 3.5533 4.2949 1.8617 4.1951 5.1911 4.6042 4.7660 4.7247 5.5296 10.3488 4.9541 7.0192 1.2599 6.2572 6.6101 9.6220 6.2629 8.9142 7.1314 4.9515 5.4856 6.0443 3.9802 1.1725 4.8809 5.3968 3.4634 5.9061 5.3125 7.0661 5.9223 6.9056 1.9673 3.6270 7.1166 1.3916 6.8689 1.8212 2.3556 4.4561 1.0609 2.6288 1.5341 2.3636 4.2439 1.2590 1.9303 1.6716 1.5926 2.3405 1.8019 1.9677 2.5398 1.6782 5.2428 5.5533 5.1816 3.6550 1.2865 4.1252 3.1120 1.5467 3.4422 2.7539 1.0440 1.0503 1.2059 2.8685 1.9735 8.1944 4.0532 4.6085 6.1001 7.0733 6.8052 1.0721 1.0326 1.0372 1.1047 1.0966 1.1002 1.0973 1.0935 1.0918 1.0922 1.0643 1.0657
irintensity: 4.0861 1.9527 0.0009 1.7297 0.0085 1.3726 0.9824 0.2347 1.7201 1.1685 4.8477 0.0126 2.9182 2.2251 1.2216 9.3827 9.8128 7.4603 8.8957 28.8257 17.7520 88.7924 4.5546 8.8316 2.9466 5.3697 0.2421 11.9999 1.9609 10.4463 28.7711 3.6220 147.9240 4.0220 50.2661 8.2117 4.5204 4.8761 12.7784 3.3532 8.3084 45.8685 1.7574 9.5685 1.0055 84.0159 31.7801 33.8089 112.5564 133.2750 23.3959 10.8518 19.2199 138.8786 0.1113 42.2292 85.8893 138.2335 38.2553 82.6391 28.0630 289.7823 249.5470 596.3272 369.6752 425.6090 70.2123 13.7103 80.3175 19.2955 23.6094 10.3320 75.6499 13.9663 15.8359 19.0493 6.4272 136.9054 381.5378 4.4992 26.1677 47.9977 200.6263 94.1188 302.5989 68.5900 20.5511 40.2123 13.0286 12.8810 21.0462 8.8242 2.1696 6.5326 113.6799 34.0666
temp: 298.150 k
press: 1.00000 atm
elementType: 8 8 8 8 8 8 6 6 6 6 6 6 6 6 6 6 6 6 6 6 6 6 1 1 1 1 1 1 1 1 1 1 1 1
symmnumber: 1
zpe: 644452.7 jmol-1
zpe.correction: 0.245459 hartree
zpe.thermalcorrener: 0.264509 hartree
zpe.thermalcorrenthalpy: 0.265453 hartree
zpe.thermalcorrgfe: 0.198764 hartree
zpe.sumelectzpe: -1066.715827 hartree
zpe.sumelectthermal: -1066.696778 hartree
zpe.sumelectthermalent: -1066.695834 hartree
zpe.sumelectthermalfe: -1066.762522 hartree
dipole: 5.6791 2.0169 0.0032
dipole: 6.0267
quadrupole: -81.6995 -135.3896 -128.0672
quadrupole: 15.5744 0.0142 0.0124
quadrupole: 33.3526 -20.3375 -13.0151 15.5744 0.0142 0.0124
hfenergy: -1066.9612866 hartree
pointgroup: C01 [X(C16H12O6)]
dipole: -2.2303927 -0.804568 0.0009333 debye
polarizability: 396.0239632|-8.6187756|224.9057892|0.0327296|0.0276395|83.5932263 unknown
InChI: InChI=1S/C16H12O6/c1-6-3-8-12(16(21)13(6)18)15(20)11-9(14(8)19)4-7(22-2)5-10(11)17/h3-5,17-18,21H,1-2H3
charge 0 multiplicity 1
34 atoms
O  2.833712 -2.430833 -0.000796
O  0.364195 -2.640507 -0.00281
O  -0.217395 2.86796 -0.000446
O  -2.309041 -2.886009 -0.001599
O  5.044016 -0.88809 0.000897
O  -4.911896 1.273359 0.000142
C  1.253708 0.956645 -0.001872
C  1.345286 -0.469696 -0.001897
C  -1.166855 -0.738709 -0.002122
C  -1.286658 0.69754 -0.002032
C  0.167999 -1.352343 -0.002629
C  -0.074954 1.601497 -0.003385
C  2.43111 1.73833 -0.000806
C  2.633277 -1.065049 -0.000966
C  3.723425 1.155575 0.000094
C  -2.379791 -1.496316 -0.001532
C  3.806638 -0.256395 -0.000032
C  -2.538883 1.327088 -0.001206
C  -3.7228 0.551417 -0.000587
C  -3.645987 -0.859234 -0.000777
C  4.987209 1.984329 0.00124
C  -6.177218 0.527167 0.000794
H  2.32095 2.827401 -0.000879
H  -2.590595 2.418823 -0.001225
H  -4.552861 -1.474409 -0.000291
H  5.611667 1.754573 -0.881484
H  4.756416 3.06179 -0.000918
H  5.608105 1.757493 0.887257
H  1.862309 -2.847735 -0.001228
H  -3.218109 -3.28237 -0.001116
H  4.887339 -1.873759 0.000621
H  -6.269833 -0.099102 -0.906681
H  -6.960361 1.298102 0.001286
H  -6.268824 -0.099231 0.908282
