program: Gaussian 09
title: 000177831
version: EM64L-G09RevD.01
frameworkgroup: C1[X(C18H31N3O4)]
method: RPBEPBE
basis: SDD
operation: Freq
keyword: #p
keyword: freq=noraman
keyword: PBEPBE/SDD
title: #p freq=noraman PBEPBE/SDD
converged: YES YES NO NO
title: Mulliken charges:
elementType: O O O O N N N C C C C C C C C C C C C C C C C C C H H H H H H H H H H H H H H H H H H H H H H H H H H H H H H H
charge: -0.332872 -0.278285 -0.417569 -0.225177 -0.138216 -0.276541 -0.360816 0.004493 -0.109386 -0.461775 -0.436459 -0.414904 -0.414344 -0.469616 -0.422932 -0.436299 -0.437578 0.211790 -0.364765 -0.533129 0.247667 -0.065181 -0.423409 -0.712552 0.190882 0.196337 0.228245 0.253248 0.186208 0.203481 0.210418 0.204319 0.195722 0.194275 0.206754 0.213896 0.226056 0.212642 0.220624 0.210465 0.170440 0.211436 0.173646 0.240324 0.225080 0.261529 0.273562 0.232284 0.358229 0.268819 0.227912 0.219801 0.232014 0.223392 0.216408 0.379410
chargesum: 0.00000
title: Mulliken charges with hydrogens summed into heavy atoms:
elementType: O O O O N N N C C C C C C C C C C C C C C C C C C
charge: -0.332872 -0.278285 -0.038159 -0.225177 -0.138216 -0.015012 -0.002587 0.200831 0.118859 -0.022319 -0.022560 -0.014863 -0.013316 -0.029665 0.010334 -0.055394 -0.052496 0.211790 0.100639 -0.027283 0.247667 0.203638 0.024304 -0.040739 0.190882
polarizability: 2.60702147e+02 -1.45173406e+01 2.23632882e+02 2.36191959e+00 -3.36669506e-02 1.84407448e+02
1716.lowfreq: -32.7483 -9.4032 -4.8962 -0.0009 -0.0006 -0.0001 5.2133 8.1870 12.6534
frequency: -28.5411 8.0938 11.4662 32.1102 34.2204 50.3555 57.5791 64.6749 71.0462 92.1528 94.9861 101.1020 122.5072 152.7298 168.5011 175.3570 196.7782 226.0606 231.4379 233.6189 234.7138 276.8244 297.6842 315.9871 321.3152 342.4778 378.6127 390.6274 401.6619 409.0934 424.5196 441.5488 447.4311 456.7989 470.2166 481.3354 518.5626 537.2743 546.9665 573.2339 594.7110 608.6339 659.2637 682.2574 697.6318 705.2070 743.2689 763.6196 787.9946 800.5806 810.2786 840.0403 860.8623 868.9242 875.9525 886.8721 888.4356 901.8334 908.3524 915.7166 926.0798 960.0926 969.0313 982.0668 983.1365 995.0848 1028.2101 1038.0900 1048.3841 1062.5181 1074.0065 1093.3317 1099.4649 1108.2966 1109.7306 1113.0425 1124.7129 1131.5653 1141.5590 1143.6768 1162.5968 1167.5822 1171.5441 1174.6349 1191.9493 1207.8256 1211.9551 1244.8150 1250.8825 1255.6577 1263.4941 1268.0556 1272.9272 1276.3183 1281.9119 1286.9648 1302.0119 1309.5369 1311.3232 1316.8885 1321.1786 1330.0597 1330.9272 1333.9744 1335.8671 1343.1583 1347.9399 1354.4692 1356.1806 1360.1043 1384.8184 1391.1315 1422.6260 1440.3369 1442.2649 1442.6460 1447.4549 1453.1887 1453.6044 1464.4446 1468.7669 1471.3159 1472.6634 1472.9236 1475.3204 1476.4777 1490.1712 1514.4952 1543.5855 1626.8302 1667.4229 2827.6287 2836.0631 2926.4289 2940.5387 2952.9343 2966.2980 2970.7850 2972.9554 2976.2532 2980.2721 2983.0281 2990.7991 3021.3995 3022.0689 3025.6543 3027.7661 3029.3697 3029.6891 3029.9060 3035.6812 3040.9961 3044.1877 3049.4379 3059.5275 3079.4710 3094.2226 3102.7332 3106.7405 3329.5948 3449.8961 3514.2275
redmass: 3.1100 4.9468 5.1866 4.7225 4.7014 6.4158 4.8257 4.0023 8.3109 3.2590 3.3036 4.0333 4.3911 3.6469 3.3059 2.5553 4.1535 4.1705 1.1601 1.8696 2.9388 2.4577 3.5558 1.9670 2.4173 3.5618 3.4502 3.1140 3.0956 3.0946 3.2694 2.4698 2.9506 2.0647 3.3248 2.6284 2.9459 3.3982 2.3412 3.2034 1.5076 2.8178 3.3403 1.7000 3.5139 1.9754 4.5849 2.0408 1.1533 1.7007 1.7750 3.4167 2.4289 2.0035 2.3548 2.1837 2.4966 2.2368 1.9570 1.9533 2.1827 2.3103 1.7021 1.7638 1.9562 2.1865 2.9130 2.0498 1.9426 1.7759 1.7979 2.1573 2.6295 2.3860 2.3439 2.0690 2.4400 2.2552 1.3258 2.1582 2.1811 1.6552 1.6704 1.7574 1.4032 1.3194 1.3710 1.4739 1.7235 1.2337 1.2569 1.5445 1.4116 1.2396 1.2516 1.1840 1.2615 1.2986 1.6874 1.3264 1.3943 1.4309 1.4447 1.4819 1.5007 1.7372 1.6234 1.2265 1.4370 1.4669 1.4301 1.2171 1.6992 1.1899 1.2364 1.1759 1.2101 1.0979 1.1000 1.0754 1.0906 1.0987 1.1012 1.0587 1.1077 1.0642 1.2735 1.7376 4.1182 5.6098 8.4004 1.0722 1.0700 1.0802 1.0809 1.0660 1.0638 1.0598 1.0599 1.0602 1.0627 1.0367 1.0636 1.0753 1.0956 1.0870 1.0622 1.0949 1.0891 1.0685 1.1024 1.1020 1.0993 1.1003 1.1031 1.0989 1.1007 1.1041 1.1045 1.0825 1.0751 1.0638
irintensity: 0.3588 0.4873 0.3816 0.8547 0.1928 1.2823 3.6214 3.6567 6.3628 1.6115 1.4719 5.3375 2.6767 1.5575 2.2311 0.5523 5.6157 4.3164 0.0409 0.8707 1.4858 2.9618 1.3350 5.3680 0.9351 11.3515 3.3713 15.0996 11.2387 5.6767 9.2013 2.9754 1.6148 4.5083 12.0019 10.2647 32.6448 24.9162 47.5535 20.3348 102.5245 18.4007 8.9979 84.6193 35.4496 22.3260 10.0601 0.3703 126.2378 0.7856 0.2644 3.2027 2.3710 12.4032 5.1192 8.0950 11.7481 3.9694 1.7733 5.9588 3.0872 5.2196 3.3820 5.2777 7.5950 7.9676 15.9796 61.6291 3.3605 3.9618 3.7903 7.6488 4.8000 70.5962 36.9082 14.6646 0.2446 0.1141 11.7889 5.4312 84.7803 4.0818 5.1686 7.0004 42.4232 8.9200 12.4120 15.4804 22.9179 1.8488 27.2919 17.7610 32.2629 6.3753 3.5095 1.3865 10.1819 1.2905 18.9918 17.2345 16.7006 13.0818 12.5109 19.1514 2.9207 17.7744 4.3878 10.3001 0.2116 2.7766 3.3619 18.6457 28.9354 0.6993 30.5887 29.1502 2.8981 11.9010 5.7992 1.1984 20.1312 13.9565 5.7213 17.1223 24.4947 36.2776 62.8722 260.0707 65.3741 227.7407 300.7590 56.0224 168.4266 15.2373 3.9468 29.5390 32.2965 10.3674 24.9506 42.7905 51.2698 21.1050 25.5270 6.6610 12.3361 87.3497 9.3510 56.8104 29.2890 5.9769 11.5259 61.7936 6.8864 114.1148 45.4067 24.2999 26.6561 26.6920 6.5961 225.3669 3.4203 22.5134
temp: 298.150 k
press: 1.00000 atm
elementType: 8 8 8 8 7 7 7 6 6 6 6 6 6 6 6 6 6 6 6 6 6 6 6 6 6 1 1 1 1 1 1 1 1 1 1 1 1 1 1 1 1 1 1 1 1 1 1 1 1 1 1 1 1 1 1 1
symmnumber: 1
zpe: 1262694.0 jmol-1
zpe.correction: 0.480935 hartree
zpe.thermalcorrener: 0.506468 hartree
zpe.thermalcorrenthalpy: 0.507412 hartree
zpe.thermalcorrgfe: 0.421484 hartree
zpe.sumelectzpe: -1167.727572 hartree
zpe.sumelectthermal: -1167.702039 hartree
zpe.sumelectthermalent: -1167.701095 hartree
zpe.sumelectthermalfe: -1167.787023 hartree
dipole: 4.1951 1.9221 0.2014
dipole: 4.6188
quadrupole: -188.9667 -131.5348 -149.4401
quadrupole: -9.0095 16.7718 -1.9710
quadrupole: -32.3195 25.1124 7.2071 -9.0095 16.7718 -1.9710
hfenergy: -1168.2085071 hartree
pointgroup: C01 [X(C18H31N3O4)]
dipole: 1.7275401 0.5509571 0.1191784 debye
polarizability: 256.4991126|-18.5195486|227.6666927|4.2205328|-1.0024019|184.576672 unknown
InChI: InChI=1S/C18H31N3O4/c1-13(11-17(23)24)20-16(22)12-21-10-2-3-15(18(21)25)5-4-14-6-8-19-9-7-14/h13-15,19-20,23H,2-12H2,1H3
charge 0 multiplicity 1
56 atoms
O  -0.21385 0.374765 -1.245607
O  -4.386026 1.496839 0.123416
O  -5.513046 -0.919803 -1.76135
O  -6.70146 -1.336466 0.191619
N  -1.210082 2.408088 -0.775317
N  6.207762 -2.535736 0.024435
N  -2.790733 -0.194029 -0.161104
C  3.703171 -1.036251 -0.273022
C  1.220269 2.083943 -0.196385
C  2.911428 0.20112 -0.761907
C  2.101367 0.92254 0.339465
C  4.751971 -0.701236 0.821109
C  4.407296 -1.738327 -1.464393
C  0.995809 3.195202 0.858402
C  0.068851 4.287432 0.295317
C  5.564336 -1.951795 1.22097
C  5.228416 -2.959383 -1.000751
C  -0.112256 1.562398 -0.766047
C  -1.30965 3.697414 -0.0387
C  -2.469644 1.90504 -1.379462
C  -3.316085 1.055678 -0.401825
C  -3.412671 -1.166371 0.751513
C  -4.377875 -2.139121 -0.01075
C  -2.316946 -1.968092 1.483738
C  -5.645581 -1.448528 -0.468078
H  2.975967 -1.758487 0.163693
H  1.755416 2.545884 -1.056084
H  2.207413 -0.115374 -1.554202
H  3.620539 0.923345 -1.22215
H  2.792879 1.346527 1.09444
H  1.460133 0.187395 0.864692
H  5.450017 0.067299 0.432063
H  4.259899 -0.287035 1.722445
H  3.655188 -2.055635 -2.213571
H  5.091646 -1.019294 -1.957076
H  0.554358 2.757034 1.776634
H  1.973888 3.623637 1.145714
H  0.523594 4.723705 -0.61535
H  -0.066838 5.109794 1.021544
H  6.350469 -1.678038 1.949361
H  4.871904 -2.674414 1.72848
H  5.776059 -3.39844 -1.855455
H  4.519288 -3.739673 -0.617469
H  -1.89296 3.530443 0.890277
H  -1.892125 4.401581 -0.661973
H  6.877068 -3.27919 0.261068
H  -2.208235 1.30397 -2.267556
H  -3.082591 2.769747 -1.679649
H  -1.890711 -0.412176 -0.622669
H  -4.013767 -0.591205 1.480122
H  -3.845257 -2.572652 -0.87416
H  -4.673773 -2.946535 0.681008
H  -1.642498 -1.287049 2.031694
H  -2.767535 -2.667869 2.208979
H  -1.707712 -2.556564 0.771776
H  -6.332693 -0.396754 -1.976412
